Benzene, 1-ethoxy-4-nitro-
- Formula: C8H9NO3
- Molecular weight: 167.1620
- IUPAC Standard InChIKey: NWPKEYHUZKMWKJ-UHFFFAOYSA-N
- CAS Registry Number: 100-29-8
- Chemical structure:
View 3d structure (requires JavaScript / HTML 5) - Other names: Phenetole, p-nitro-; p-Ethoxynitrobenzene; p-Nitrophenetole; Ethyl p-nitrophenyl ether; 1-Ethoxy-4-nitrobenzene; 4-Ethoxynitrobenzene; 4-Nitrophenetole; p-Nitrophenetol; NSC 9812

Phase change data

Data compiled by: Robert L. Brown and Stephen E. Stein
Quantity | Value | Units | Method | Reference | Comment |
---|---|---|---|---|---|
Tboil | 556.2 | K | N/A | Weast and Grasselli, 1989 |
Reduced pressure boiling point
Tboil (K) | Pressure (bar) | Reference |
---|---|---|
386.7 | 0.004 | Aldrich Chemical Company Inc., 1990 |

Gas phase ion energetics data

Data compiled by: Henry M. Rosenstock, Keith Draxl, Bruce W. Steiner, and John T. Herron
Ionization energy determinations
IE (eV) | Method | Reference |
---|---|---|
9.22 ± 0.15 | EI | McLafferty and Schiff, 1969 |
Appearance energy determinations
Ion | AE (eV) | Other Products | Method | Reference | Comment |
---|---|---|---|---|---|
C6H5NO3+ | 10.97 ± 0.15 | C2H4 | EI | McLafferty and Schiff, 1969 |

References

Weast and Grasselli, 1989
CRC Handbook of Data on Organic Compounds, 2nd Editon, Weast,R.C and Grasselli, J.G., ed(s)., CRC Press, Inc., Boca Raton, FL, 1989, 1. [all data]
Aldrich Chemical Company Inc., 1990
Aldrich Chemical Company Inc.,
Catalog Handbook of Fine Chemicals, Aldrich Chemical Company, Inc., Milwaukee WI, 1990, 1. [all data]
McLafferty and Schiff, 1969
McLafferty, F.W.; Schiff, L.J.,
The structure of [YC6H5O]+ ions in the spectra of aryl alkyl ethers,
Org. Mass Spectrom., 1969, 2, 757. [all data]