niobium pentachloride
- Formula: Cl5Nb
- Molecular weight: 270.171
- CAS Registry Number: 10026-12-7

Gas phase thermochemistry data

Quantity | Value | Units | Method | Reference | Comment |
---|---|---|---|---|---|
ΔfH°gas | -703.33 | kJ/mol | Review | Chase, 1998 | Data last reviewed in December, 1974 |
Quantity | Value | Units | Method | Reference | Comment |
S°gas,1 bar | 404.07 | J/mol*K | Review | Chase, 1998 | Data last reviewed in December, 1974 |
Gas Phase Heat Capacity (Shomate Equation)
Cp° = A + B*t + C*t2 + D*t3 +
E/t2
H° − H°298.15= A*t + B*t2/2 +
C*t3/3 + D*t4/4 − E/t + F − H
S° = A*ln(t) + B*t + C*t2/2 + D*t3/3 −
E/(2*t2) + G
Cp = heat capacity (J/mol*K)
H° = standard enthalpy (kJ/mol)
S° = standard entropy (J/mol*K)
t = temperature (K) / 1000.
View plot Requires a JavaScript / HTML 5 canvas capable browser.
Temperature (K) | 800. to 6000. |
---|---|
A | 131.8940 |
B | 0.990980 |
C | -0.272647 |
D | 0.023520 |
E | -1.186221 |
F | -746.6850 |
G | 556.7280 |
H | -703.3300 |
Reference | Chase, 1998 |
Comment | Data last reviewed in December, 1974 |

Condensed phase thermochemistry data

Quantity | Value | Units | Method | Reference | Comment |
---|---|---|---|---|---|
ΔfH°liquid | -773.35 | kJ/mol | Review | Chase, 1998 | Data last reviewed in December, 1974 |
Quantity | Value | Units | Method | Reference | Comment |
S°liquid,1 bar | 260.97 | J/mol*K | Review | Chase, 1998 | Data last reviewed in December, 1974 |
Quantity | Value | Units | Method | Reference | Comment |
ΔfH°solid | -797.47 | kJ/mol | Review | Chase, 1998 | Data last reviewed in December, 1974 |
Quantity | Value | Units | Method | Reference | Comment |
S°solid | 214.05 | J/mol*K | Review | Chase, 1998 | Data last reviewed in December, 1974 |
Liquid Phase Heat Capacity (Shomate Equation)
Cp° = A + B*t + C*t2 + D*t3 +
E/t2
H° − H°298.15= A*t + B*t2/2 +
C*t3/3 + D*t4/4 − E/t + F − H
S° = A*ln(t) + B*t + C*t2/2 + D*t3/3 −
E/(2*t2) + G
Cp = heat capacity (J/mol*K)
H° = standard enthalpy (kJ/mol)
S° = standard entropy (J/mol*K)
t = temperature (K) / 1000.
View plot Requires a JavaScript / HTML 5 canvas capable browser.
Temperature (K) | 478.9 to 800. |
---|---|
A | 241.2590 |
B | -5.524870 |
C | -85.62220 |
D | -2.629081 |
E | -0.052983 |
F | -848.7050 |
G | 544.9610 |
H | -773.3540 |
Reference | Chase, 1998 |
Comment | Data last reviewed in December, 1974 |
Solid Phase Heat Capacity (Shomate Equation)
Cp° = A + B*t + C*t2 + D*t3 +
E/t2
H° − H°298.15= A*t + B*t2/2 +
C*t3/3 + D*t4/4 − E/t + F − H
S° = A*ln(t) + B*t + C*t2/2 + D*t3/3 −
E/(2*t2) + G
Cp = heat capacity (J/mol*K)
H° = standard enthalpy (kJ/mol)
S° = standard entropy (J/mol*K)
t = temperature (K) / 1000.
View plot Requires a JavaScript / HTML 5 canvas capable browser.
Temperature (K) | 298. to 478.9 |
---|---|
A | 147.9040 |
B | 0.000105 |
C | -0.000220 |
D | 0.000148 |
E | 1.052271×10-7 |
F | -841.5680 |
G | 393.0410 |
H | -797.4700 |
Reference | Chase, 1998 |
Comment | Data last reviewed in December, 1974 |

Gas phase ion energetics data

Data compiled as indicated in comments:
LLK - Sharon G. Lias, Rhoda D. Levin, and Sherif A. Kafafi
RDSH - Henry M. Rosenstock, Keith Draxl, Bruce W. Steiner, and John T. Herron
Ionization energy determinations
IE (eV) | Method | Reference | Comment |
---|---|---|---|
10.97 | PE | Egdell and Orchard, 1978 | LLK |
Appearance energy determinations
Ion | AE (eV) | Other Products | Method | Reference | Comment |
---|---|---|---|---|---|
ClNb+ | 24.2 | ? | EI | Preiss, 1972 | LLK |
NbCl+ | 22.8 ± 0.5 | ? | EI | Kiser, Dillard, et al., 1969 | RDSH |
Cl2Nb+ | 19.5 | ? | EI | Preiss, 1972 | LLK |
NbCl2+ | 18.8 ± 0.3 | ? | EI | Kiser, Dillard, et al., 1969 | RDSH |
NbCl2+ | 20. ± 1. | ? | EI | Kencshea and Cubicciotti, 1969 | RDSH |
Cl3Nb+ | 14.6 | ? | EI | Preiss, 1972 | LLK |
NbCl3+ | 14.9 ± 0.8 | ? | EI | Kencshea and Cubicciotti, 1969 | RDSH |
Cl4Nb+ | 10.7 | ? | EI | Preiss, 1972 | LLK |
NbCl4+ | 11.34 ± 0.22 | Cl | EI | Kiser, Dillard, et al., 1969 | RDSH |
NbCl4+ | 11.6 ± 0.8 | Cl | EI | Kencshea and Cubicciotti, 1969 | RDSH |
Nb+ | 28.0 ± 0.7 | ? | EI | Kiser, Dillard, et al., 1969 | RDSH |

Phase change data

Data compiled by: William E. Acree, Jr., James S. Chickos
Quantity | Value | Units | Method | Reference | Comment |
---|---|---|---|---|---|
ΔsubH° | 95. ± 16. | kJ/mol | N/A | Türler, Eichler, et al., 1996 |

References

Chase, 1998
Chase, M.W., Jr.,
NIST-JANAF Themochemical Tables, Fourth Edition,
J. Phys. Chem. Ref. Data, Monograph 9, 1998, 1-1951. [all data]
Egdell and Orchard, 1978
Egdell, R.G.; Orchard, A.F.,
Photoelectron spectra of some transition metal pentachlorides,
J. Electron Spectrosc. Relat. Phenom., 1978, 14, 277. [all data]
Preiss, 1972
Preiss, H.,
Massenspektrometrische Untersuchungen an einigen Halogeniden der 5. Haupt- und Nebengruppe,
Z. Anorg. Allg. Chem., 1972, 389, 280. [all data]
Kiser, Dillard, et al., 1969
Kiser, R.W.; Dillard, J.G.; Dugger, D.L.,
Mass spectrometry of inorganic halides,
Advan. Chem. Ser., 1969, 72, 153. [all data]
Kencshea and Cubicciotti, 1969
Kencshea, F.J.; Cubicciotti, D.,
The thermodynamic properties of gaseous niobium chlorides,
J. Phys. Chem., 1969, 73, 3054. [all data]