zirconium tetrachloride
- Formula: Cl4Zr
- Molecular weight: 233.036
- CAS Registry Number: 10026-11-6

Gas phase thermochemistry data

Quantity | Value | Units | Method | Reference | Comment |
---|---|---|---|---|---|
ΔfH°gas | -869.98 | kJ/mol | Review | Chase, 1998 | Data last reviewed in June, 1975 |
Quantity | Value | Units | Method | Reference | Comment |
S°gas,1 bar | 367.69 | J/mol*K | Review | Chase, 1998 | Data last reviewed in June, 1975 |
Gas Phase Heat Capacity (Shomate Equation)
Cp° = A + B*t + C*t2 + D*t3 +
E/t2
H° − H°298.15= A*t + B*t2/2 +
C*t3/3 + D*t4/4 − E/t + F − H
S° = A*ln(t) + B*t + C*t2/2 + D*t3/3 −
E/(2*t2) + G
Cp = heat capacity (J/mol*K)
H° = standard enthalpy (kJ/mol)
S° = standard entropy (J/mol*K)
t = temperature (K) / 1000.
View plot Requires a JavaScript / HTML 5 canvas capable browser.
Temperature (K) | 298. to 6000. |
---|---|
A | 107.3761 |
B | 0.608048 |
C | -0.164909 |
D | 0.014079 |
E | -0.838515 |
F | -904.8318 |
G | 492.7413 |
H | -869.9791 |
Reference | Chase, 1998 |
Comment | Data last reviewed in June, 1975 |

Condensed phase thermochemistry data

Quantity | Value | Units | Method | Reference | Comment |
---|---|---|---|---|---|
ΔfH°solid | -980.52 | kJ/mol | Review | Chase, 1998 | Data last reviewed in June, 1975 |
Quantity | Value | Units | Method | Reference | Comment |
S°solid | 181.41 | J/mol*K | Review | Chase, 1998 | Data last reviewed in June, 1975 |
Solid Phase Heat Capacity (Shomate Equation)
Cp° = A + B*t + C*t2 + D*t3 +
E/t2
H° − H°298.15= A*t + B*t2/2 +
C*t3/3 + D*t4/4 − E/t + F − H
S° = A*ln(t) + B*t + C*t2/2 + D*t3/3 −
E/(2*t2) + G
Cp = heat capacity (J/mol*K)
H° = standard enthalpy (kJ/mol)
S° = standard entropy (J/mol*K)
t = temperature (K) / 1000.
View plot Requires a JavaScript / HTML 5 canvas capable browser.
Temperature (K) | 298. to 1000. |
---|---|
A | 125.3832 |
B | 12.59330 |
C | 2.041952 |
D | -0.931342 |
E | -0.845850 |
F | -1021.319 |
G | 324.5516 |
H | -980.5204 |
Reference | Chase, 1998 |
Comment | Data last reviewed in June, 1975 |

Phase change data

Data compiled as indicated in comments:
TRC - Thermodynamics Research Center, NIST Boulder Laboratories, Chris Muzny director
AC - William E. Acree, Jr., James S. Chickos
Quantity | Value | Units | Method | Reference | Comment |
---|---|---|---|---|---|
Tc | 778.2 | K | N/A | Denisova, Safronova, et al., 1967 | Uncertainty assigned by TRC = 0.5 K; TRC |
Quantity | Value | Units | Method | Reference | Comment |
Pc | 57.70 | bar | N/A | Denisova, Safronova, et al., 1967 | Uncertainty assigned by TRC = 0.56 bar; TRC |
Pc | 58.50 | bar | N/A | Nisel'son, Stolyarov, et al., 1965 | Uncertainty assigned by TRC = 0.5841 bar; From value of Tc=503.5 deg C by Nisel'son and Sokolova, Russ. J. Inorg. Chem. 1962, 7, 1382, and VP measured to 500 deg; TRC |
Quantity | Value | Units | Method | Reference | Comment |
Vc | 0.319 | l/mol | N/A | Denisova, Safronova, et al., 1967 | Uncertainty assigned by TRC = 0.000319 l/mol; Vis, rect, VP, TE, sample by chlorination of metal cont. <0 Hf, other impurities 0.001% each; TRC |
Antoine Equation Parameters
log10(P) = A − (B / (T + C))
P = vapor pressure (bar)
T = temperature (K)
View plot Requires a JavaScript / HTML 5 canvas capable browser.
Temperature (K) | A | B | C | Reference | Comment |
---|---|---|---|---|---|
463. to 604. | 8.74048 | 4954.507 | -36.557 | Stull, 1947 | Coefficents calculated by NIST from author's data. |
Enthalpy of sublimation
ΔsubH (kJ/mol) | Temperature (K) | Method | Reference | Comment |
---|---|---|---|---|
98.9 ± 0.5 | 512. | T | Tangri and Bose, 1994 | Based on data from 405. to 518. K.; AC |

Gas phase ion energetics data

Data compiled by: Sharon G. Lias, Rhoda D. Levin, and Sherif A. Kafafi
Ionization energy determinations
IE (eV) | Method | Reference | Comment |
---|---|---|---|
11.2 | PE | Egdell and Orchard, 1978 | |
10.6 | EI | Preiss, 1972 | |
11.94 | PE | Egdell and Orchard, 1978 | Vertical value |
Appearance energy determinations
Ion | AE (eV) | Other Products | Method | Reference | Comment |
---|---|---|---|---|---|
ClZr+ | 21.9 | ? | EI | Preiss, 1972 | |
Cl2Zr+ | 12.3 | ? | EI | Preiss, 1972 | |
Cl2Zr+ | 16.8 | ? | EI | Preiss, 1972 |

Vibrational and/or electronic energy levels

Data compiled by: Takehiko Shimanouchi
Symmetry: Td Symmetry Number σ = 12
Sym. | No | Approximate | Selected Freq. | Infrared | Raman | Comments | ||||
---|---|---|---|---|---|---|---|---|---|---|
Species | type of mode | Value | Rating | Value | Phase | Value | Phase | |||
a1 | 1 | Sym str | 377 | B | 388 ia | gas | 377 VS p | gas | Estimated from combination bands | |
e | 2 | Deg deform | 98 | B | 102 ia | gas | 98 | gas | Estimated from combination bands | |
f2 | 3 | Deg str | 418 | C | 421 | gas | 418 VW | gas | ||
f2 | 4 | Deg deform | 113 | C | 112 | gas | 113 | gas | Estimated from combination bands | |
Source: Shimanouchi, 1972

References

Chase, 1998
Chase, M.W., Jr.,
NIST-JANAF Themochemical Tables, Fourth Edition,
J. Phys. Chem. Ref. Data, Monograph 9, 1998, 1-1951. [all data]
Denisova, Safronova, et al., 1967
Denisova, N.D.; Safronova, E.K.; Pustil'nik, A.I.; Bystrova, O.N.,
Boundary Liqui-Vapor Curve and Saturated Vapour Pressure of Zirconium and Hafnium Tetrachlorides,
Russ. J. Phys. Chem. (Engl. Transl.), 1967, 41, 30. [all data]
Nisel'son, Stolyarov, et al., 1965
Nisel'son, L.A.; Stolyarov, V.I.; Sokolova, T.D.,
Some Properties of Liquid Zirconium Tetrachloride,
Russ. J. Phys. Chem. (Engl. Transl.), 1965, 39, 1614. [all data]
Stull, 1947
Stull, Daniel R.,
Vapor Pressure of Pure Substances. Organic and Inorganic Compounds,
Ind. Eng. Chem., 1947, 39, 4, 517-540, https://doi.org/10.1021/ie50448a022
. [all data]
Tangri and Bose, 1994
Tangri, R.P.; Bose, D.K.,
Vapour pressure measurement of zirconium chloride and hafnium chloride by the transpiration technique,
Thermochimica Acta, 1994, 244, 249-256, https://doi.org/10.1016/0040-6031(94)80224-6
. [all data]
Egdell and Orchard, 1978
Egdell, R.G.; Orchard, A.F.,
Photoelectron spectra of the group IVA halides,
J. Chem. Soc. Faraday Trans. 2, 1978, 74, 485. [all data]
Preiss, 1972
Preiss, H.,
Massenspektrometrische Untersuchungen an einigen Halogeniden der 5. Haupt- und Nebengruppe,
Z. Anorg. Allg. Chem., 1972, 389, 280. [all data]
Shimanouchi, 1972
Shimanouchi, T.,
Tables of Molecular Vibrational Frequencies Consolidated Volume II,
J. Phys. Chem. Ref. Data, 1972, 6, 3, 993-1102. [all data]