antimony trichloride
- Formula: Cl3Sb
- Molecular weight: 228.119
- CAS Registry Number: 10025-91-9

Reaction thermochemistry data

Data compiled by: John E. Bartmess
Individual Reactions
+ Cl3Sb = Cl4Sb-
By formula: Cl- + Cl3Sb = Cl4Sb-
Quantity | Value | Units | Method | Reference | Comment |
---|---|---|---|---|---|
ΔrH° | 160. ± 7.9 | kJ/mol | CIDT | Walker, Check, et al., 2002 | gas phase |

Gas phase ion energetics data

Data compiled as indicated in comments:
LBLHLM - Sharon G. Lias, John E. Bartmess, Joel F. Liebman, John L. Holmes, Rhoda D. Levin, and W. Gary Mallard
LLK - Sharon G. Lias, Rhoda D. Levin, and Sherif A. Kafafi
Ionization energy determinations
IE (eV) | Method | Reference | Comment |
---|---|---|---|
11.0 ± 0.1 | EI | Ozgen, 1983 | LBLHLM |
10.73 | PE | Nicholson and Rademacher, 1974 | Vertical value; LLK |
10.70 | PE | Lee and Rabalais, 1974 | Vertical value; LLK |
Appearance energy determinations
Ion | AE (eV) | Other Products | Method | Reference | Comment |
---|---|---|---|---|---|
ClSb+ | 12.5 ± 0.1 | Cl2/2Cl | EI | Ozgen, 1983 | LBLHLM |
Cl2Sb+ | 11.8 ± 0.1 | Cl | EI | Ozgen, 1983 | LBLHLM |

Ion clustering data

Data compiled by: John E. Bartmess
Clustering reactions
+ Cl3Sb = Cl4Sb-
By formula: Cl- + Cl3Sb = Cl4Sb-
Quantity | Value | Units | Method | Reference | Comment |
---|---|---|---|---|---|
ΔrH° | 160. ± 7.9 | kJ/mol | CIDT | Walker, Check, et al., 2002 | gas phase |

Phase change data

Data compiled as indicated in comments:
TRC - Thermodynamics Research Center, NIST Boulder Laboratories, Chris Muzny director

Quantity Value Units Method Reference Comment
Tc798.KN/ASladkov and Shimeleva, 1974Uncertainty assigned by TRC = 2. K; TRC
Quantity Value Units Method Reference Comment
Vc0.254l/molN/ASladkov and Shimeleva, 1974Uncertainty assigned by TRC = 0.005 l/mol; Abstract, no details; TRC

Antoine Equation Parameters

log10(P) = A − (B / (T + C))
    P = vapor pressure (atm)
    T = temperature (K)

View plot Requires a JavaScript / HTML 5 canvas capable browser.

Temperature (K) A B C Reference Comment
322.4 - 492.3.263411200.884-125.836Stull, 1947Coefficents calculated by NIST from author's data.

In addition to the Thermodynamics Research Center (TRC) data available from this site, much more physical and chemical property data is available from the following TRC products:

References

Walker, Check, et al., 2002
Walker, B.W.; Check, C.E.; Lobring, K.C.; Pommerening, C.A.; Sunderlin, L.S.,
The Thermochemistry of Group 15 Tetrachloride Anions,
J. Am. Soc. Mass Spectrom., 2002, 13, 5, 469, https://doi.org/10.1016/S1044-0305(02)00369-0
. [all data]
Ozgen, 1983
Ozgen, T.,
Mass spectrometric determination of the appearance potentials of PCl3, AsCl3, SbCl3, BiCl3 and their fragments,
Int. J. Mass Spectrom. Ion Processes, 1983, 48, 427. [all data]
Nicholson and Rademacher, 1974
Nicholson, D.G.; Rademacher, P.,
Photoelectron spectra and electronic structures of antimony(III) halides,
Acta Chem. Scand. Ser. A:, 1974, 28, 1136. [all data]
Lee and Rabalais, 1974
Lee, T.H.; Rabalais, J.W.,
Model for spin- orbit interactions with inclusion of d electrons: Applications to photoelectron spectroscopy,
J. Chem. Phys., 1974, 60, 1172. [all data]