Phosphorus oxychloride
- Formula: Cl3OP
- Molecular weight: 153.332
- IUPAC Standard InChIKey: XHXFXVLFKHQFAL-UHFFFAOYSA-N
- CAS Registry Number: 10025-87-3
- Chemical structure:
View 3d structure (requires JavaScript / HTML 5) - Other names: Phosphoryl chloride; Phosphoric chloride; Phosphoric trichloride; Phosphorus chloride oxide (POCl3); Phosphorus oxide trichloride; Phosphorus oxytrichloride; Phosphoryl trichloride; Trichlorophosphine oxide; Trichlorophosphorus oxide; POCl3; Phosphorus(V) trichloride oxide; Phosphorous oxychloride; Phosphorus oxide chloride; Fosforoxychlorid; Oxychlorid fosforecny; UN 1810; OPCl3; Phosphoroxychloride

Gas phase thermochemistry data

Quantity | Value | Units | Method | Reference | Comment |
---|---|---|---|---|---|
ΔfH°gas | -559.82 | kJ/mol | Review | Chase, 1998 | Data last reviewed in June, 1962 |
Quantity | Value | Units | Method | Reference | Comment |
S°gas,1 bar | 325.45 | J/mol*K | Review | Chase, 1998 | Data last reviewed in June, 1962 |
Gas Phase Heat Capacity (Shomate Equation)
Cp° = A + B*t + C*t2 + D*t3 +
E/t2
H° − H°298.15= A*t + B*t2/2 +
C*t3/3 + D*t4/4 − E/t + F − H
S° = A*ln(t) + B*t + C*t2/2 + D*t3/3 −
E/(2*t2) + G
Cp = heat capacity (J/mol*K)
H° = standard enthalpy (kJ/mol)
S° = standard entropy (J/mol*K)
t = temperature (K) / 1000.
View plot Requires a JavaScript / HTML 5 canvas capable browser.
Temperature (K) | 298. to 1000. | 1000. to 6000. |
---|---|---|
A | 75.07602 | 107.4757 |
B | 77.36509 | 0.352779 |
C | -71.30456 | -0.073164 |
D | 23.86746 | 0.005165 |
E | -0.669089 | -3.451110 |
F | -587.3039 | -601.7596 |
G | 392.4337 | 440.3953 |
H | -559.8192 | -559.8192 |
Reference | Chase, 1998 | Chase, 1998 |
Comment | Data last reviewed in June, 1962 | Data last reviewed in June, 1962 |

Phase change data

Data compiled as indicated in comments:
TRC - Thermodynamics Research Center, NIST Boulder Laboratories, Chris Muzny director
Quantity | Value | Units | Method | Reference | Comment |
---|---|---|---|---|---|
Tfus | 274.2 | K | N/A | Witschonke, 1954 | Uncertainty assigned by TRC = 0.15 K; TRC |
Tfus | 274.35 | K | N/A | Witschonke, 1954 | Uncertainty assigned by TRC = 0.1 K; TRC |
Quantity | Value | Units | Method | Reference | Comment |
Tc | 601. | K | N/A | Sladkov and Parusova, 1977 | Uncertainty assigned by TRC = 4. K; TRC |
Quantity | Value | Units | Method | Reference | Comment |
Pc | 49.60 | bar | N/A | Sladkov and Parusova, 1977 | Uncertainty assigned by TRC = 0.50 bar; TRC |
Quantity | Value | Units | Method | Reference | Comment |
Vc | 0.276 | l/mol | N/A | Sladkov and Parusova, 1977 | Uncertainty assigned by TRC = 0.005 l/mol; From Abstract; TRC |
Antoine Equation Parameters
log10(P) = A − (B / (T + C))
P = vapor pressure (bar)
T = temperature (K)
View plot Requires a JavaScript / HTML 5 canvas capable browser.
Temperature (K) | A | B | C | Reference | Comment |
---|---|---|---|---|---|
275. to 378.3 | 4.28166 | 1445.959 | -40.119 | Stull, 1947 | Coefficents calculated by NIST from author's data. |

Reaction thermochemistry data

Data compiled by: John E. Bartmess
Individual Reactions
+
= Cl4OP-
By formula: Cl- + Cl3OP = Cl4OP-
Quantity | Value | Units | Method | Reference | Comment |
---|---|---|---|---|---|
ΔrH° | 43.1 ± 5.0 | kJ/mol | CIDT | Check, Lobring, et al., 2003 | gas phase |

Gas phase ion energetics data

Data evaluated as indicated in comments:
L - Sharon G. Lias
Data compiled as indicated in comments:
LLK - Sharon G. Lias, Rhoda D. Levin, and Sherif A. Kafafi
RDSH - Henry M. Rosenstock, Keith Draxl, Bruce W. Steiner, and John T. Herron
B - John E. Bartmess
Quantity | Value | Units | Method | Reference | Comment |
---|---|---|---|---|---|
IE (evaluated) | 11.5 ± 0.1 | eV | N/A | N/A | L |
Electron affinity determinations
EA (eV) | Method | Reference | Comment |
---|---|---|---|
1.41 ± 0.20 | NBIE | Mathur, Rothe, et al., 1976 | B |
Ionization energy determinations
IE (eV) | Method | Reference | Comment |
---|---|---|---|
11.36 ± 0.02 | PE | Bunzli, Frost, et al., 1973 | LLK |
11.58 ± 0.05 | PE | Basset and Lloyd, 1972 | LLK |
11.4 ± 0.3 | EI | Kiser, Dillard, et al., 1969 | RDSH |
13.1 ± 0.2 | EI | Halmann and Klein, 1964 | RDSH |
11.89 | PE | Chattorpadhyay, Findley, et al., 1981 | Vertical value; LLK |
11.89 ± 0.02 | PE | Gan, Peel, et al., 1977 | Vertical value; LLK |
11.49 | PE | Vovna, Lopatin, et al., 1975 | Vertical value; LLK |
11.89 ± 0.03 | PE | Cox, Evans, et al., 1972 | Vertical value; LLK |
12.0 | PE | Betteridge, Thompson, et al., 1972 | Vertical value; LLK |
Appearance energy determinations
Ion | AE (eV) | Other Products | Method | Reference | Comment |
---|---|---|---|---|---|
Cl+ | 19. ± 1. | ? | EI | Halmann and Klein, 1964 | RDSH |
POCl+ | 15.6 ± 0.3 | ? | EI | Kiser, Dillard, et al., 1969 | RDSH |
PCl+ | 20.2 ± 0.4 | ? | EI | Kiser, Dillard, et al., 1969 | RDSH |
PCl+ | 17. ± 1. | ? | EI | Halmann and Klein, 1964 | RDSH |
POCl2+ | 12.8 ± 0.3 | Cl | EI | Kiser, Dillard, et al., 1969 | RDSH |
POCl2+ | 13.3 ± 0.2 | Cl | EI | Halmann and Klein, 1964 | RDSH |
PCl2+ | 13.3 ± 0.5 | ? | EI | Halmann and Klein, 1964 | RDSH |
PCl3+ | 12.3 ± 0.5 | O | EI | Halmann and Klein, 1964 | RDSH |
O+ | 13. ± 2. | ? | EI | Halmann and Klein, 1964 | RDSH |
PO+ | 16.6 ± 0.4 | ? | EI | Kiser, Dillard, et al., 1969 | RDSH |
PO+ | 14.5 ± 0.5 | ? | EI | Halmann and Klein, 1964 | RDSH |
P+ | 28.1 ± 0.5 | ? | EI | Kiser, Dillard, et al., 1969 | RDSH |
P+ | 21.4 | ? | EI | Halmann and Klein, 1964 | RDSH |

Ion clustering data

Data compiled by: John E. Bartmess
Clustering reactions
+
= Cl4OP-
By formula: Cl- + Cl3OP = Cl4OP-
Quantity | Value | Units | Method | Reference | Comment |
---|---|---|---|---|---|
ΔrH° | 43.1 ± 5.0 | kJ/mol | CIDT | Check, Lobring, et al., 2003 | gas phase |

Vibrational and/or electronic energy levels

Data compiled by: Takehiko Shimanouchi
Symmetry: C2 Symmetry Number σ = 2
Sym. | No | Approximate | Selected Freq. | Infrared | Raman | Comments | ||||
---|---|---|---|---|---|---|---|---|---|---|
Species | type of mode | Value | Rating | Value | Phase | Value | Phase | |||
a1 | 1 | PO str | 1322 | C | 1321.5 | gas | ||||
a1 | 2 | PCl3 s-str | 481 | C | 480.5 | gas | ||||
a1 | 3 | PCl3 s-deform | 266 | C | 265.5 | gas | ||||
e | 4 | PCl3 d-str | 590 | C | 589.5 | gas | ||||
e | 5 | PO bend | 333 | C | 332.5 | gas | ||||
e | 6 | PCl3 d-deform | 187 | C | 187.0 | gas | ||||
Source: Shimanouchi, 1972

References

Chase, 1998
Chase, M.W., Jr.,
NIST-JANAF Themochemical Tables, Fourth Edition,
J. Phys. Chem. Ref. Data, Monograph 9, 1998, 1-1951. [all data]
Witschonke, 1954
Witschonke, C.R.,
Freezing point and purity data for some organic compounds,
Anal. Chem., 1954, 26, 562-4. [all data]
Sladkov and Parusova, 1977
Sladkov, I.B.; Parusova, N.D.,
Russ. J. Phys. Chem. (Engl. Transl.), 1977, 51, 319. [all data]
Stull, 1947
Stull, Daniel R.,
Vapor Pressure of Pure Substances. Organic and Inorganic Compounds,
Ind. Eng. Chem., 1947, 39, 4, 517-540, https://doi.org/10.1021/ie50448a022
. [all data]
Check, Lobring, et al., 2003
Check, C.E.; Lobring, K.C.; Keating, P.R.; Gilbert, T.M.; Sunderlin, L.S.,
Effect of substituents on the strength of hypervalent phosphorus-halogen bonds,
J. Phys. Chem. A, 2003, 107, 42, 8961-8967, https://doi.org/10.1021/jp030287x
. [all data]
Mathur, Rothe, et al., 1976
Mathur, B.P.; Rothe, E.W.; Tang, S.Y.; Reck, G.,
Negative ions from phosphorus halides due to cesium charge exchange,
J. Chem. Phys., 1976, 64, 565. [all data]
Bunzli, Frost, et al., 1973
Bunzli, J.C.; Frost, D.C.; McDowell, C.A.,
Photoelectron spectra of phosphoryl and thioophosphoryl ch;prodes and bromides,
J. Electron Spectrosc. Relat. Phenom., 1973, 1, 481. [all data]
Basset and Lloyd, 1972
Basset, P.J.; Lloyd, D.R.,
Photoelectron spectra of halides. Part III. Trifluorides and oxide trifluorides of nitrogen and phosphorus, and phosphorus oxide trichloride,
J. Chem. Soc. Dalton Trans., 1972, 248. [all data]
Kiser, Dillard, et al., 1969
Kiser, R.W.; Dillard, J.G.; Dugger, D.L.,
Mass spectrometry of inorganic halides,
Advan. Chem. Ser., 1969, 72, 153. [all data]
Halmann and Klein, 1964
Halmann, M.; Klein, Y.,
Electron-impact spectroscopy of phosphorus compounds. Part III. Positive- andnegative-ion formation from phosphorus trichloride and phosphoryl chloride,
J. Chem. Soc., 1964, 4324. [all data]
Chattorpadhyay, Findley, et al., 1981
Chattorpadhyay, S.; Findley, G.L.; McGlynn, S.P.,
Photoelectron spectroscopy of phosphites and phosphates,
J. Electron Spectrosc. Relat. Phenom., 1981, 24, 27. [all data]
Gan, Peel, et al., 1977
Gan, T.H.; Peel, J.B.; Willett, G.D.,
Comparison of He I and He II photoelectron spectra of phosphoryl chloride,
Chem. Phys. Lett., 1977, 48, 483. [all data]
Vovna, Lopatin, et al., 1975
Vovna, V.I.; Lopatin, S.N.; Pettsol'd, R.; Vilesov, F.I.,
Photoelectron spectra and electronic structure of some phosphoryl compounds,
Khim. Vys. Energ., 1975, 9, 9. [all data]
Cox, Evans, et al., 1972
Cox, P.A.; Evans, S.; Orchard, A.F.; Richardson, N.V.; Roberts, P.J.,
Simple quantitative molecular orbital methods used in connection with photoelectron spectroscopy,
Faraday Discuss. Chem. Soc., 1972, 54, 26. [all data]
Betteridge, Thompson, et al., 1972
Betteridge, D.; Thompson, M.; Baker, A.D.; Kemp, N.R.,
Photoelectron spectra of phosphorus halides, alkyl phosphites and phosphates, organophosphorus pesticides, and related compounds,
Anal. Chem., 1972, 44, 2005. [all data]
Shimanouchi, 1972
Shimanouchi, T.,
Tables of Molecular Vibrational Frequencies Consolidated Volume II,
J. Phys. Chem. Ref. Data, 1972, 6, 3, 993-1102. [all data]