dysprosium trichloride
- Formula: Cl3Dy
- Molecular weight: 268.859
- CAS Registry Number: 10025-74-8

Phase change data

Data compiled by: William E. Acree, Jr., James S. Chickos
Quantity | Value | Units | Method | Reference | Comment |
---|---|---|---|---|---|
ΔsubH° | 283. ± 5.0 | kJ/mol | TE | Brunetti, Vassallo, et al., 1999 | Based on data from 924. to 1214. K. |

Gas phase ion energetics data

Data compiled by: Sharon G. Lias, John E. Bartmess, Joel F. Liebman, John L. Holmes, Rhoda D. Levin, and W. Gary Mallard
Ionization energy determinations
IE (eV) | Method | Reference | Comment |
---|---|---|---|
11.42 ± 0.06 | PE | Lee, Potts, et al., 1982 | Vertical value |
Appearance energy determinations
Ion | AE (eV) | Other Products | Method | Reference | Comment |
---|---|---|---|---|---|
Dy+ | 10.20 ± 0.06 | 3Cl | EI | Sapegin, Baluev, et al., 1984 |

Reaction thermochemistry data

Data compiled by: John E. Bartmess

Individual Reactions

TbCl4- + Cl3Dy = Cl7DyTb-

By formula: TbCl4- + Cl3Dy = Cl7DyTb-

Quantity Value Units Method Reference Comment
Δr360. ± 50.kJ/molTDEqKhasanshin, Kudin, et al., 1999gas phase; value altered from reference due to conversion from electron convention to ion convention

Ion clustering data

Data compiled by: John E. Bartmess

Clustering reactions

TbCl4- + Cl3Dy = Cl7DyTb-

By formula: TbCl4- + Cl3Dy = Cl7DyTb-

Quantity Value Units Method Reference Comment
Δr360. ± 50.kJ/molTDEqKhasanshin, Kudin, et al., 1999gas phase; value altered from reference due to conversion from electron convention to ion convention

References

Brunetti, Vassallo, et al., 1999
Brunetti, Bruno; Vassallo, Papirio; Piacente, Vincenzo; Scardala, Paolo,
Vaporization Studies of Dysprosium Trichloride, Tribromide, and Triiodide,
J. Chem. Eng. Data, 1999, 44, 3, 509-515, https://doi.org/10.1021/je9801821
. [all data]
Lee, Potts, et al., 1982
Lee, E.P.F.; Potts, A.W.; Bloor, J.E.,
HeI and HeII photoelectron spectra of lanthanide trichlorides in the vapour phase,
Proc. R. Soc. London A, 1982, 381, 373. [all data]
Sapegin, Baluev, et al., 1984
Sapegin, A.M.; Baluev, A.V.; Evdokimov, V.I.,
Mass-spectrometric investigation of the thermochemistry of the chlorides of the lanthanides,
Russ. J. Phys. Chem., 1984, 58, 1792. [all data]