Sulfur monochloride
- Formula: Cl2S2
- Molecular weight: 135.036
- IUPAC Standard InChIKey: PXJJSXABGXMUSU-UHFFFAOYSA-N
- CAS Registry Number: 10025-67-9
- Chemical structure:
View 3d structure (requires JavaScript / HTML 5) - Other names: Disulfur dichloride; Sulfur chloride (S2Cl2); Chlorosulfane; Sulfur chloride; Sulfur subchloride; Thiosulfurous dichloride; S2Cl2; Chloride of sulfur; Siarki chlorek; Sulfur chloride(di); ClSSCl; disulphur dichloride

Gas phase thermochemistry data

Quantity | Value | Units | Method | Reference | Comment |
---|---|---|---|---|---|
ΔfH°gas | -16.74 | kJ/mol | Review | Chase, 1998 | Data last reviewed in June, 1978 |
Quantity | Value | Units | Method | Reference | Comment |
S°gas,1 bar | 327.19 | J/mol*K | Review | Chase, 1998 | Data last reviewed in June, 1978 |
Gas Phase Heat Capacity (Shomate Equation)
Cp° = A + B*t + C*t2 + D*t3 +
E/t2
H° − H°298.15= A*t + B*t2/2 +
C*t3/3 + D*t4/4 − E/t + F − H
S° = A*ln(t) + B*t + C*t2/2 + D*t3/3 −
E/(2*t2) + G
Cp = heat capacity (J/mol*K)
H° = standard enthalpy (kJ/mol)
S° = standard entropy (J/mol*K)
t = temperature (K) / 1000.
View plot Requires a JavaScript / HTML 5 canvas capable browser.
Temperature (K) | 1000. to 1500. |
---|---|
A | 76.49900 |
B | 15.01043 |
C | -8.794643 |
D | 1.471627 |
E | -0.663440 |
F | -42.37262 |
G | 411.9324 |
H | -16.73600 |
Reference | Chase, 1998 |
Comment | Data last reviewed in June, 1978 |

Condensed phase thermochemistry data

Quantity | Value | Units | Method | Reference | Comment |
---|---|---|---|---|---|
ΔfH°liquid | -58.16 | kJ/mol | Review | Chase, 1998 | Data last reviewed in June, 1978 |
Quantity | Value | Units | Method | Reference | Comment |
S°liquid,1 bar | 223.84 | J/mol*K | Review | Chase, 1998 | Data last reviewed in June, 1978 |
Liquid Phase Heat Capacity (Shomate Equation)
Cp° = A + B*t + C*t2 + D*t3 +
E/t2
H° − H°298.15= A*t + B*t2/2 +
C*t3/3 + D*t4/4 − E/t + F − H
S° = A*ln(t) + B*t + C*t2/2 + D*t3/3 −
E/(2*t2) + G
Cp = heat capacity (J/mol*K)
H° = standard enthalpy (kJ/mol)
S° = standard entropy (J/mol*K)
t = temperature (K) / 1000.
View plot Requires a JavaScript / HTML 5 canvas capable browser.
Temperature (K) | 298. to 1000. |
---|---|
A | 124.2903 |
B | 0.000000 |
C | 0.000000 |
D | 0.000000 |
E | 0.000000 |
F | -95.21529 |
G | 374.2550 |
H | -58.15802 |
Reference | Chase, 1998 |
Comment | Data last reviewed in June, 1978 |

Phase change data

Data compiled as indicated in comments:
TRC - Thermodynamics Research Center, NIST Boulder Laboratories, Chris Muzny director
AC - William E. Acree, Jr., James S. Chickos
Quantity | Value | Units | Method | Reference | Comment |
---|---|---|---|---|---|
Tfus | 192.1 | K | N/A | Witschonke, 1954 | Uncertainty assigned by TRC = 0.2 K; TRC |
Tfus | 192.25 | K | N/A | Witschonke, 1954 | Uncertainty assigned by TRC = 0.1 K; TRC |
Tfus | 464. | K | N/A | Whiting, 1952 | Uncertainty assigned by TRC = 3. K; TRC |
Enthalpy of vaporization
ΔvapH (kJ/mol) | Temperature (K) | Reference | Comment |
---|---|---|---|
41.1 | 321. | Dykyj, Svoboda, et al., 1999 | Based on data from 306. to 439. K.; AC |
Antoine Equation Parameters
log10(P) = A − (B / (T + C))
P = vapor pressure (bar)
T = temperature (K)
View plot Requires a JavaScript / HTML 5 canvas capable browser.
Temperature (K) | A | B | C | Reference | Comment |
---|---|---|---|---|---|
265.8 to 411. | 4.0648 | 1417.43 | -61.685 | Stull, 1947 | Coefficents calculated by NIST from author's data. |

Reaction thermochemistry data

Data compiled by: Hussein Y. Afeefy, Joel F. Liebman, and Stephen E. Stein
Individual Reactions
By formula: C8H20N2S2 + 2C4H12ClN = Cl2S2 + 4C4H11N
Quantity | Value | Units | Method | Reference | Comment |
---|---|---|---|---|---|
ΔrH° | 365.3 ± 2.9 | kJ/mol | Cm | Claydon and Mortimer, 1962 | liquid phase; Reanalyzed by Cox and Pilcher, 1970, Original value = 368. ± 3. kJ/mol |

Gas phase ion energetics data

Data compiled as indicated in comments:
LLK - Sharon G. Lias, Rhoda D. Levin, and Sherif A. Kafafi
Ionization energy determinations
IE (eV) | Method | Reference | Comment |
---|---|---|---|
9.66 ± 0.03 | PI | Kaufel, Vahl, et al., 1981 | LLK |
11.3 ± 0.2 | EI | Hartmann, Lebert, et al., 1974 | LLK |
9.4 | PE | Colton and Rabalais, 1974 | LLK |
Appearance energy determinations
Ion | AE (eV) | Other Products | Method | Reference | Comment |
---|---|---|---|---|---|
ClS+ | 12.06 ± 0.05 | SCl | PI | Kaufel, Vahl, et al., 1981 | LLK |
ClS2+ | 11.10 ± 0.03 | Cl | PI | Kaufel, Vahl, et al., 1981 | LLK |
S2Cl+ | 12.2 ± 0.2 | Cl | EI | Hartmann, Lebert, et al., 1974 | LLK |
S2+ | 9.20 ± 0.05 | Cl2 | PI | Kaufel, Vahl, et al., 1981 | LLK |

References

Chase, 1998
Chase, M.W., Jr.,
NIST-JANAF Themochemical Tables, Fourth Edition,
J. Phys. Chem. Ref. Data, Monograph 9, 1998, 1-1951. [all data]
Witschonke, 1954
Witschonke, C.R.,
Freezing point and purity data for some organic compounds,
Anal. Chem., 1954, 26, 562-4. [all data]
Whiting, 1952
Whiting, G.H.,
Freezing and MElting of Some Sulfur Chlorides,
J. Appl. Chem., 1952, 2, 390. [all data]
Dykyj, Svoboda, et al., 1999
Dykyj, J.; Svoboda, J.; Wilhoit, R.C.; Frenkel, M.L.; Hall, K.R.,
Vapor Pressure of Chemicals: Part A. Vapor Pressure and Antoine Constants for Hydrocarbons and Sulfur, Selenium, Tellurium and Hydrogen Containing Organic Compounds, Springer, Berlin, 1999, 373. [all data]
Stull, 1947
Stull, Daniel R.,
Vapor Pressure of Pure Substances. Organic and Inorganic Compounds,
Ind. Eng. Chem., 1947, 39, 4, 517-540, https://doi.org/10.1021/ie50448a022
. [all data]
Claydon and Mortimer, 1962
Claydon, A.P.; Mortimer, C.T.,
Heats of formation and bond energies. Part VIII. Diethylaminotrimethylsilane, NN'-dithiodiethylamine, NN'-thionylbisdiethylamine, and NN'-sulphurylbisdiethylamine,
J. Chem. Soc., 1962, 3212-3216. [all data]
Cox and Pilcher, 1970
Cox, J.D.; Pilcher, G.,
Thermochemistry of Organic and Organometallic Compounds, Academic Press, New York, 1970, 1-636. [all data]
Kaufel, Vahl, et al., 1981
Kaufel, R.; Vahl, G.; Minkwitz, R.; Baumgartel, H.,
Die photoionenspektren von SCl2, S2Cl2 und S2Br2,
Z. Anorg. Allg. Chem., 1981, 481, 207. [all data]
Hartmann, Lebert, et al., 1974
Hartmann, O.-R.; Lebert, K.-H.; Chun, H.-U.,
Elektronenstoss- und ionenstossuntersuchungen an schwefeldichlorid und dischwefeldichlorid,
Z. Phys. Chem. (Frankfurt/Main), 1974, 92, 311. [all data]
Colton and Rabalais, 1974
Colton, R.J.; Rabalais, J.W.,
Photoelectron electronic absorption spectra of SCl2, S2Cl2, S2Br2 and (CH3)2S2,
J. Electron Spectrosc. Relat. Phenom., 1974, 3, 345. [all data]