1,2-Propadiene, 1-bromo-
- Formula: C3H3Br
- Molecular weight: 118.960
- IUPAC Standard InChIKey: UUIORUQWCRSGJS-UHFFFAOYSA-N
- CAS Registry Number: 10024-18-7
- Chemical structure:
View 3d structure (requires JavaScript / HTML 5) - Other names: Propa-1,2-diene, 1-bromo-; 1-Bromopropadiene

Gas phase ion energetics data

Data compiled by: Sharon G. Lias, Rhoda D. Levin, and Sherif A. Kafafi
Ionization energy determinations
IE (eV) | Method | Reference | Comment |
---|---|---|---|
9.46 | PE | Kroner, Kosbahn, et al., 1977 | Vertical value |

References

Kroner, Kosbahn, et al., 1977
Kroner, J.; Kosbahn, W.; Runge, W.,
The molecular structure of allenes and ketenes, IX[1]π and σ interactions in allenes: Photoelectron spectra, electronic absorption spectra, and quantum chemical calculations,
Ber. Bunsen-Ges. Phys. Chem., 1977, 81, 826. [all data]
Kroner, et al., 1977
Kroner, J., et al.,
Ber. Bunsen-Gesellschaft Ph. Chem., 1977, 81, 826. [all data]