Decane, 3-chloro-
- Formula: C10H21Cl
- Molecular weight: 176.727
- IUPAC Standard InChIKey: SMVZPOXWOUHGQI-UHFFFAOYSA-N
- CAS Registry Number: 1002-11-5
- Chemical structure:
View 3d structure (requires JavaScript / HTML 5) - Other names: 3-Chlorodecane

Reaction thermochemistry data

Data compiled by: Hussein Y. Afeefy, Joel F. Liebman, and Stephen E. Stein
Individual Reactions
By formula: C10H21Cl = C10H21Cl
Quantity | Value | Units | Method | Reference | Comment |
---|---|---|---|---|---|
ΔrH° | 0.02 | kJ/mol | Ciso | Roganov, Kabo, et al., 1969 | liquid phase |

Kovats' RI, non-polar column, isothermal

Column type | Active phase | Temperature (C) | I | Reference | Comment |
---|---|---|---|---|---|
Packed | Apiezon L | 150. | 1215. | Jaworski, 1982 |

Kovats' RI, polar column, isothermal

Column type | Active phase | Temperature (C) | I | Reference | Comment |
---|---|---|---|---|---|
Packed | PEG-20M | 130. | 1376. | Jaworski and Zolna, 1982 | Chromosorb W; Column length: 2.8 m |
Packed | PEG-20M | 130. | 1376. | Jaworski, 1982 |

Kovats' RI, polar column, temperature ramp

Column type | Active phase | I | Reference | Comment |
---|---|---|---|---|
Packed | PEG-20M | 1374. | Jaworski and Zolna, 1982 | Chromosorb W, 6. K/min; Column length: 2.8 m; Tstart: 110. C; Tend: 200. C |

Lee's RI, non-polar column, custom temperature program

Column type | Active phase | I | Reference | Comment |
---|---|---|---|---|
Capillary | DB-5MS | 232.7 | Aracil, Font, et al., 2005 | Column length: 60. m; Column diameter: 0.25 mm; Program: not specified |

References

Roganov, Kabo, et al., 1969
Roganov, G.N.; Kabo, G.Ya.; Adreevskii, D.N.,
Additivity of thermochemical properties for isomers of secondary n-alkane chlorides (C5-C10),
J. Org. Chem. USSR (Engl. Transl.), 1969, 5, 2037-2041. [all data]
Jaworski, 1982
Jaworski, M.,
Wybrane przyklady stosowania systemu indeksów retencji,
Przem. Chem., 1982, 61, 9, 334-338. [all data]
Jaworski and Zolna, 1982
Jaworski, M.; Zolna, H.,
Oznaczanie alkanów, monochloroalkanów i polichloroalkanów metoda chromatografii gazowej,
Chem. Anal. (Warsaw), 1982, 27, 97-105. [all data]
Aracil, Font, et al., 2005
Aracil, I.; Font, R.; Conesa, J.A.,
Semivolatile and volatile compounds from the pyrolysis and combustion of polyvinyl chloride,
J. Anal. Appl. Pyrolysis, 2005, 74, 1-2, 465-478, https://doi.org/10.1016/j.jaap.2004.09.008
. [all data]