Molybdenum tetrakis(dimethylamide)
- Formula: C8H24MoN4
- Molecular weight: 272.26
- CAS Registry Number: 100207-68-9

Condensed phase thermochemistry data

Data compiled by: José A. Martinho Simões
Quantity | Value | Units | Method | Reference | Comment |
---|---|---|---|---|---|
ΔfH°solid | 58.9 ± 5.1 | kJ/mol | Review | Martinho Simões |

Phase change data

Data compiled as indicated in comments:
AC - William E. Acree, Jr., James S. Chickos
MS - José A. Martinho Simões
Quantity | Value | Units | Method | Reference | Comment |
---|---|---|---|---|---|
ΔsubH° | 72. ± 6. | kJ/mol | C | Adedeji, Cavell, et al., 1979 | See also Pilcher and Skinner, 1983.; AC |
ΔsubH° | 72.4 ± 6.0 | kJ/mol | RSC | Adedeji, Cavell, et al., 1979 | MS |
Enthalpy of sublimation
ΔsubH (kJ/mol) | Temperature (K) | Method | Reference | Comment |
---|---|---|---|---|
88. ± 3. | 376. | C | Adedeji, Cavell, et al., 1979 | AC |

Gas phase ion energetics data

Data compiled as indicated in comments:
LLK - Sharon G. Lias, Rhoda D. Levin, and Sherif A. Kafafi
Ionization energy determinations
IE (eV) | Method | Reference | Comment |
---|---|---|---|
5.30 | PE | Chisholm, Cowley, et al., 1980 | Vertical value; LLK |

Gas phase thermochemistry data

Data compiled by: José A. Martinho Simões
Quantity | Value | Units | Method | Reference | Comment |
---|---|---|---|---|---|
ΔfH°gas | 131.3 ± 7.9 | kJ/mol | Review | Martinho Simões |

References

Martinho Simões
Martinho Simões, J.A.,
Private communication (see http://webbook.nist.gov/chemistry/om/). [all data]
Adedeji, Cavell, et al., 1979
Adedeji, F.A.; Cavell, K.J.; Cavell, S.; Connor, J.A.; Skinner, H.A.; Zafarani-Moattar, M.T.,
J. Chem. Soc. Faraday Trans. 1, 1979, 75, 603. [all data]
Pilcher and Skinner, 1983
Pilcher, G.; Skinner, H.A.,
Thermochemistry of organometallic compounds, 1983, 43-90, https://doi.org/10.1002/9780470771686.ch2
. [all data]
Chisholm, Cowley, et al., 1980
Chisholm, M.H.; Cowley, A.H.; Lattman, M.,
A UV photoelectron spectroscopic investigation of the bonding in some tri-, tetra-, and penta- coordinated dialkylamino compounds of chromium, molybdenum, niobium, and tantalum,
J. Am. Chem. Soc., 1980, 102, 46. [all data]