Benzene, 1,4-bis(1-methylethyl)-
- Formula: C12H18
- Molecular weight: 162.2713
- IUPAC Standard InChIKey: SPPWGCYEYAMHDT-UHFFFAOYSA-N
- CAS Registry Number: 100-18-5
- Chemical structure:
View 3d structure (requires JavaScript / HTML 5) - Other names: Benzene, p-diisopropyl-; p-Diisopropylbenzene; 1,4-Diisopropylbenzene; 1,4-Bis(1-methylethyl)benzene; 4-Isopropylcumene; Benzene, 1,4-di-(1-methylethyl); Benzene, 1,4-diisopropyl-

Condensed phase thermochemistry data

Data compiled by: Hussein Y. Afeefy, Joel F. Liebman, and Stephen E. Stein
Quantity | Value | Units | Method | Reference | Comment |
---|---|---|---|---|---|
ΔfH°liquid | -132.3 | kJ/mol | Eqk | Popov, Rozhnov, et al., 1974 |

Phase change data

Data compiled as indicated in comments:
BS - Robert L. Brown and Stephen E. Stein
TRC - Thermodynamics Research Center, NIST Boulder Laboratories, Chris Muzny director
AC - William E. Acree, Jr., James S. Chickos
Quantity | Value | Units | Method | Reference | Comment |
---|---|---|---|---|---|
Tboil | 483.5 | K | N/A | Weast and Grasselli, 1989 | BS |
Tboil | 483.52 | K | N/A | Melpolder, Woodbridge, et al., 1948 | Uncertainty assigned by TRC = 2. K; TRC |
Tboil | 483.5 | K | N/A | Newton, 1943 | Uncertainty assigned by TRC = 2. K; TRC |
Tboil | 477. | K | N/A | Toussaint and Hennion, 1940 | Uncertainty assigned by TRC = 8. K; TRC |
Tboil | 477.65 | K | N/A | O'Connor and Sowa, 1938 | Uncertainty assigned by TRC = 1.5 K; TRC |
Quantity | Value | Units | Method | Reference | Comment |
Tfus | 256.07 | K | N/A | McDonald, Shrader, et al., 1959 | Uncertainty assigned by TRC = 0.05 K; TRC |
Tfus | 256.11 | K | N/A | Streiff, Hulme, et al., 1955 | Uncertainty assigned by TRC = 0.02 K; TRC |
Tfus | 256.11 | K | N/A | Streiff, Hulme, et al., 1955 | Uncertainty assigned by TRC = 0.02 K; TRC |
Tfus | 256.12 | K | N/A | Streiff, Hulme, et al., 1955 | Uncertainty assigned by TRC = 0.01 K; TRC |
Tfus | 256.08 | K | N/A | Melpolder, Woodbridge, et al., 1948 | Uncertainty assigned by TRC = 1. K; TRC |
Quantity | Value | Units | Method | Reference | Comment |
Tc | 794.15 | K | N/A | Glaser and Ruland, 1957 | Uncertainty assigned by TRC = 3. K; TRC |
Quantity | Value | Units | Method | Reference | Comment |
Pc | 97.7786 | bar | N/A | Glaser and Ruland, 1957 | Uncertainty assigned by TRC = 4.053 bar; TRC |
Quantity | Value | Units | Method | Reference | Comment |
ΔvapH° | 56.5 ± 0.3 | kJ/mol | GS | Verekin, 1998 | Based on data from 283. to 318. K.; AC |
Enthalpy of vaporization
ΔvapH (kJ/mol) | Temperature (K) | Method | Reference | Comment |
---|---|---|---|---|
50.7 ± 0.2 | 400. | EB | Steele, Chirico, et al., 2002 | Based on data from 366. to 530. K.; AC |
46.3 ± 0.3 | 440. | EB | Steele, Chirico, et al., 2002 | Based on data from 366. to 530. K.; AC |
43.0 ± 0.5 | 480. | EB | Steele, Chirico, et al., 2002 | Based on data from 366. to 530. K.; AC |
39.3 ± 0.9 | 520. | EB | Steele, Chirico, et al., 2002 | Based on data from 366. to 530. K.; AC |
56.3 ± 0.3 | 301. | GS | Verekin, 1998 | Based on data from 283. to 318. K.; AC |
47.6 | 408. | A | Stephenson and Malanowski, 1987 | Based on data from 393. to 485. K.; AC |
48.9 | 408. | N/A | McDonald, Shrader, et al., 1959, 2 | Based on data from 393. to 485. K. See also Boublik, Fried, et al., 1984.; AC |
Antoine Equation Parameters
log10(P) = A − (B / (T + C))
P = vapor pressure (bar)
T = temperature (K)
View plot Requires a JavaScript / HTML 5 canvas capable browser.
Temperature (K) | A | B | C | Reference |
---|---|---|---|---|
393.41 to 484.73 | 3.8176 | 1641.44 | -81.204 | McDonald, Shrader, et al., 1959, 2 |

Reaction thermochemistry data

Data compiled by: Hussein Y. Afeefy, Joel F. Liebman, and Stephen E. Stein
Individual Reactions
By formula: 2C9H12 = C12H18 + C6H6
Quantity | Value | Units | Method | Reference | Comment |
---|---|---|---|---|---|
ΔrH° | 1.5 ± 0.63 | kJ/mol | Eqk | Popov, Rozhnov, et al., 1974 | gas phase |
By formula: C12H18 = C12H18
Quantity | Value | Units | Method | Reference | Comment |
---|---|---|---|---|---|
ΔrH° | 0.0 ± 0.54 | kJ/mol | Eqk | Popov, Rozhnov, et al., 1974 | gas phase |

Gas phase ion energetics data

Data compiled by: Sharon G. Lias, Rhoda D. Levin, and Sherif A. Kafafi
Ionization energy determinations
IE (eV) | Method | Reference |
---|---|---|
8.35 | PE | Bock, Kaim, et al., 1978 |

Kovats' RI, non-polar column, isothermal

Column type | Active phase | Temperature (C) | I | Reference | Comment |
---|---|---|---|---|---|
Capillary | DB-1MS | 90. | 1152.7 | Vickers, Kuhn, et al., 2003 | 30. m/0.25 mm/0.25 μm, He |
Capillary | DB-1 | 90. | 1152.1 | Vickers, Kuhn, et al., 2003 | 30. m/0.25 mm/0.25 μm, He |
Capillary | DB-5 | 60. | 1168.7 | Kuhn, 2001 | 30. m/0.25 mm/0.25 μm, H2 |
Capillary | DB-5MS | 60. | 1168.9 | Kuhn, 2001 | 30. m/0.25 mm/0.25 μm, H2 |
Capillary | OV-101 | 100. | 1160. | Matisová, Kovacicová, et al., 1989 | He; Column length: 50. m; Column diameter: 0.20 mm |
Capillary | OV-101 | 100. | 1160. | Matisová, Rukríglová, et al., 1988 | H2; Column length: 278. m; Column diameter: 0.25 mm |
Capillary | OV-101 | 100. | 1162. | Gerasimenko and Nabivach, 1982 | N2; Column length: 50. m; Column diameter: 0.30 mm |
Capillary | OV-101 | 120. | 1167. | Gerasimenko and Nabivach, 1982 | N2; Column length: 50. m; Column diameter: 0.30 mm |
Capillary | OV-101 | 140. | 1171. | Gerasimenko and Nabivach, 1982 | N2; Column length: 50. m; Column diameter: 0.30 mm |
Capillary | Squalane | 86. | 1151.2 | Macák, Nabivach, et al., 1982 | N2; Column length: 50. m; Column diameter: 0.25 mm |
Capillary | Squalane | 96. | 1153.4 | Macák, Nabivach, et al., 1982 | N2; Column length: 50. m; Column diameter: 0.25 mm |
Capillary | OV-101 | 100. | 1161.6 | Gerasimenko, Kirilenko, et al., 1981 | N2; Column length: 50. m; Column diameter: 0.3 mm |
Capillary | OV-101 | 120. | 1166.7 | Gerasimenko, Kirilenko, et al., 1981 | N2; Column length: 50. m; Column diameter: 0.3 mm |
Capillary | OV-101 | 140. | 1171.3 | Gerasimenko, Kirilenko, et al., 1981 | N2; Column length: 50. m; Column diameter: 0.3 mm |
Capillary | Squalane | 86. | 1151.2 | Nabivach, Bur'yan, et al., 1978 | Column length: 50. m; Column diameter: 0.25 mm |
Capillary | Squalane | 96. | 1153.4 | Nabivach, Bur'yan, et al., 1978 | Column length: 50. m; Column diameter: 0.25 mm |
Capillary | Squalane | 100. | 1154. | Engewald and Wennrich, 1976 | N2; Column length: 100. m; Column diameter: 0.23 mm |
Capillary | Squalane | 80. | 1148.55 | Soják and Rijks, 1976 | H2; Column length: 100. m; Column diameter: 0.25 mm |
Capillary | SE-30 | 65. | 1152.0 | Svob and Deur-Siftar, 1974 | He; Column length: 25.5 m; Column diameter: 0.5 mm |

Kovats' RI, non-polar column, temperature ramp

Column type | Active phase | I | Reference | Comment |
---|---|---|---|---|
Capillary | OV-101 | 1158. | Hayes and Pitzer, 1982 | 110. m/0.25 mm/0.20 μm, He, 1. K/min; Tstart: 35. C; Tend: 200. C |
Capillary | Apiezon L | 1179. | Louis, 1971 | N2, 1. K/min; Column length: 50. m; Column diameter: 0.25 mm; Tstart: 60. C |

Kovats' RI, non-polar column, custom temperature program

Column type | Active phase | I | Reference | Comment |
---|---|---|---|---|
Capillary | Petrocol DH-100 | 1159.5 | Haagen-Smit Laboratory, 1997 | He; Column length: 100. m; Column diameter: 0.2 mm; Program: 5C(10min) => 5C/min => 50C(48min) => 1.5C/min => 195C(91min) |
Capillary | Squalane | 1183. | Medvedovskaya, Tikhomirova, et al., 1997 | Program: not specified |

Kovats' RI, polar column, isothermal

Column type | Active phase | Temperature (C) | I | Reference | Comment |
---|---|---|---|---|---|
Capillary | Carbowax 20M | 100. | 1380.7 | Engewald and Wennrich, 1976 | N2; Column length: 100. m; Column diameter: 0.23 mm |
Capillary | Carbowax 6000 | 90. | 1417.6 | Svob and Deur-Siftar, 1974 | He; Column length: 10. m; Column diameter: 0.25 mm |

Van Den Dool and Kratz RI, non-polar column, temperature ramp

Column type | Active phase | I | Reference | Comment |
---|---|---|---|---|
Capillary | DB-5 | 1170.1 | Song, Lai, et al., 2003 | 30. m/0.25 mm/0.25 μm, He, 2. K/min; Tstart: 40. C; Tend: 310. C |
Capillary | DB-5 | 1173.4 | Song, Lai, et al., 2003 | 30. m/0.25 mm/0.25 μm, He, 4. K/min; Tstart: 40. C; Tend: 310. C |
Capillary | DB-5 | 1174.7 | Song, Lai, et al., 2003 | 30. m/0.25 mm/0.25 μm, He, 6. K/min; Tstart: 40. C; Tend: 310. C |
Capillary | DB-1 | 1154.4 | Sun and Stremple, 2003 | 30. m/0.25 mm/0.25 μm, He, 3. K/min; Tstart: 40. C; Tend: 325. C |
Capillary | OV-1 | 1160.9 | Gautzsch and Zinn, 1996 | 8. K/min; Tstart: 35. C; Tend: 300. C |
Capillary | DB-5 | 1170.1 | Lai and Song, 1995 | 30. m/0.25 mm/0.25 μm, He, 2. K/min; Tstart: 40. C; Tend: 310. C |
Capillary | DB-5 | 1173.4 | Lai and Song, 1995 | 30. m/0.25 mm/0.25 μm, He, 4. K/min; Tstart: 40. C; Tend: 310. C |
Capillary | DB-5 | 1174.7 | Lai and Song, 1995 | 30. m/0.25 mm/0.25 μm, He, 6. K/min; Tstart: 40. C; Tend: 310. C |
Capillary | Petrocol DH | 1160. | White, Hackett, et al., 1992 | 100. m/0.25 mm/0.5 μm, He, 1. K/min; Tstart: 30. C; Tend: 220. C |
Capillary | OV-101 | 1158. | Hayes and Pitzer, 1981 | 108. m/0.25 mm/0.2 μm, 1. K/min; Tstart: 35. C; Tend: 200. C |

Van Den Dool and Kratz RI, polar column, temperature ramp

Column type | Active phase | I | Reference | Comment |
---|---|---|---|---|
Capillary | DB-Wax | 1404. | Shimoda, Wu, et al., 1996 | 60. m/0.25 mm/0.25 μm, He, 3. K/min; Tstart: 50. C; Tend: 230. C |

Normal alkane RI, non-polar column, isothermal

Column type | Active phase | Temperature (C) | I | Reference | Comment |
---|---|---|---|---|---|
Capillary | Methyl Silicone | 120. | 1162. | Chen and Feng, 2006 | |
Capillary | OV-101 | 100. | 1162. | Tian, 1993 | Column length: 50. m; Column diameter: 0.20 mm |
Capillary | OV-101 | 100. | 1162. | Tian, 1993 | Column length: 50. m; Column diameter: 0.20 mm |
Capillary | OV-101 | 120. | 1167. | Tian, 1993 | Column length: 50. m; Column diameter: 0.20 mm |
Capillary | OV-101 | 120. | 1167. | Tian, 1993 | Column length: 50. m; Column diameter: 0.20 mm |
Capillary | Squalane | 95.4 | 1143. | Sojak and Vigdergauz, 1978 | H2 |
Capillary | Squalane | 110. | 1157. | Papazova and Pankova, 1975 | N2; Column length: 100. m; Column diameter: 0.25 mm |
Capillary | Squalane | 130. | 1162. | Papazova and Pankova, 1975 | N2; Column length: 100. m; Column diameter: 0.25 mm |

Normal alkane RI, non-polar column, temperature ramp

Column type | Active phase | I | Reference | Comment |
---|---|---|---|---|
Capillary | Petrocol DH | 1168. | Supelco, 2012 | 100. m/0.25 mm/0.50 μm, Helium, 20. C @ 15. min, 15. K/min, 220. C @ 30. min |

Normal alkane RI, non-polar column, custom temperature program

Column type | Active phase | I | Reference | Comment |
---|---|---|---|---|
Capillary | SE-30 | 1161. | Xiuhua, Zhang, et al., 1996 | Program: not specified |
Capillary | OV-1, SE-30, Methyl silicone, SP-2100, OV-101, DB-1, etc. | 1158. | Waggott and Davies, 1984 | Hydrogen; Column length: 50. m; Column diameter: 0.32 mm; Program: not specified |

Normal alkane RI, polar column, isothermal

Column type | Active phase | Temperature (C) | I | Reference | Comment |
---|---|---|---|---|---|
Capillary | PEG-40M | 100. | 1402. | Nesterov, Nesterova, et al., 2000 | Column length: 50. m |
Capillary | PEG-40M | 100. | 1402. | Nesterov, Nesterova, et al., 2000 | Column length: 50. m |
Capillary | PEG-40M | 120. | 1412. | Nesterov, Nesterova, et al., 2000 | Column length: 50. m |
Capillary | PEG-40M | 140. | 1426. | Nesterov, Nesterova, et al., 2000 | Column length: 50. m |
Capillary | PEG-40M | 160. | 1435. | Nesterov, Nesterova, et al., 2000 | Column length: 50. m |
Capillary | PEG-40M | 80. | 1392. | Nesterov, Nesterova, et al., 2000 | Column length: 50. m |

Normal alkane RI, polar column, temperature ramp

Column type | Active phase | I | Reference | Comment |
---|---|---|---|---|
Capillary | Carbowax 20M | 1358. | Herain, MRAVEC, et al., 1991 | 70. C @ 21. min, 5. K/min, 150. C @ 999. min |

Normal alkane RI, polar column, custom temperature program

Column type | Active phase | I | Reference | Comment |
---|---|---|---|---|
Capillary | Carbowax 400, Carbowax 20M, Carbowax 1540, Carbowax 4000, Superox 06, PEG 20M, etc. | 1418. | Waggott and Davies, 1984 | Hydrogen; Column length: 50. m; Column diameter: 0.32 mm; Program: not specified |

References

Popov, Rozhnov, et al., 1974
Popov, V.E.; Rozhnov, A.M.; Satronov, V.S.; Volkova, A.G.,
Disproportionation equilibrium for isopropylbenzene,
Neftekhimiya, 1974, 14, 364-367. [all data]
Weast and Grasselli, 1989
CRC Handbook of Data on Organic Compounds, 2nd Editon, Weast,R.C and Grasselli, J.G., ed(s)., CRC Press, Inc., Boca Raton, FL, 1989, 1. [all data]
Melpolder, Woodbridge, et al., 1948
Melpolder, F.W.; Woodbridge, J.E.; Headington, C.E.,
The isolation and physical properties of the diisopropyl- benzenes,
J. Am. Chem. Soc., 1948, 70, 935-9. [all data]
Newton, 1943
Newton, A.,
Polyisopropylbenzenes: I preparation and properties of two di-, two tri-, and one tetra-isopropylbenzene,
J. Am. Chem. Soc., 1943, 65, 320-3. [all data]
Toussaint and Hennion, 1940
Toussaint, N.F.; Hennion, G.F.,
Alkylation of Benzene with Alcohols, Boron Fluoride, and Assistants,
J. Am. Chem. Soc., 1940, 62, 1145. [all data]
O'Connor and Sowa, 1938
O'Connor, M.J.; Sowa, F.J.,
Organic Reactions with Boron Fluoride XVIII. The Reaction of ethers with Benzene,
J. Am. Chem. Soc., 1938, 60, 125. [all data]
McDonald, Shrader, et al., 1959
McDonald, R.A.; Shrader, S.A.; Stull, D.R.,
Vapor Pressures and Freezing Points of 30 Organics,
J. Chem. Eng. Data, 1959, 4, 311. [all data]
Streiff, Hulme, et al., 1955
Streiff, A.J.; Hulme, A.R.; Cowie, P.A.; Krouskop, N.C.; Rossini, F.D.,
Purification, Purity, and Freezing Points of Sixty-four American Petroleum Institute Standard and Research Hydrocarbons,
Anal. Chem., 1955, 27, 411. [all data]
Glaser and Ruland, 1957
Glaser, F.; Ruland, H.,
Untersuchungsen über dampfdruckkurven und kritische daten einiger technisch wichtiger organischer substanzen,
Chem. Ing. Techn., 1957, 29, 772. [all data]
Verekin, 1998
Verekin, S.P.,
Thermochemical properties of isopropylbenzenes,
Thermochim. Acta, 1998, 316, 131-136. [all data]
Steele, Chirico, et al., 2002
Steele, W.V.; Chirico, R.D.; Cowell, A.B.; Knipmeyer, S.E.; Nguyen, A.,
Thermodynamic Properties and Ideal-Gas Enthalpies of Formation for 1,4-Diisopropylbenzene, 1,2,4,5-Tetraisopropylbenzene, Cyclohexanone Oxime, Dimethyl Malonate, Glutaric Acid, and Pimelic Acid,
J. Chem. Eng. Data, 2002, 47, 4, 725-739, https://doi.org/10.1021/je010088b
. [all data]
Stephenson and Malanowski, 1987
Stephenson, Richard M.; Malanowski, Stanislaw,
Handbook of the Thermodynamics of Organic Compounds, 1987, https://doi.org/10.1007/978-94-009-3173-2
. [all data]
McDonald, Shrader, et al., 1959, 2
McDonald, R.A.; Shrader, S.A.; Stull, D.R.,
Vapor Pressures and Freezing Points of Thirty Pure Organic Compounds.,
J. Chem. Eng. Data, 1959, 4, 4, 311-313, https://doi.org/10.1021/je60004a009
. [all data]
Boublik, Fried, et al., 1984
Boublik, T.; Fried, V.; Hala, E.,
The Vapour Pressures of Pure Substances: Selected Values of the Temperature Dependence of the Vapour Pressures of Some Pure Substances in the Normal and Low Pressure Region, 2nd ed., Elsevier, New York, 1984, 972. [all data]
Bock, Kaim, et al., 1978
Bock, H.; Kaim, W.; Rohwer, H.E.,
Die hyperkonjugative Stabilisierung von p-Xylol-Radikalkationen durch (H3C)3Si-Substituenten,
Chem. Ber., 1978, 111, 3573. [all data]
Kusakov, et al., 1963
Kusakov, M.M., et al.,
Ultraviolet Absorption Spectra of Aromatic Hydrocarbons, 1963, 66. [all data]