Cyanoallene
- Formula: C4H3N
- Molecular weight: 65.0733
- IUPAC Standard InChIKey: IRLQAJPIHBZROB-UHFFFAOYSA-N
- CAS Registry Number: 1001-56-5
- Chemical structure:
View 3d structure (requires JavaScript / HTML 5) - Permanent link for this species. Use this link for bookmarking this species for future reference.

Gas phase ion energetics data

Data compiled as indicated in comments:
LLK - Sharon G. Lias, Rhoda D. Levin, and Sherif A. Kafafi
Ionization energy determinations
IE (eV) | Method | Reference | Comment |
---|---|---|---|
10.1 | PE | Kroner, Kosbahn, et al., 1977 | LLK |
10.35 | PE | Kroner, Kosbahn, et al., 1977 | Vertical value; LLK |

References

Kroner, Kosbahn, et al., 1977
Kroner, J.; Kosbahn, W.; Runge, W.,
The molecular structure of allenes and ketenes, IX[1]π and σ interactions in allenes: Photoelectron spectra, electronic absorption spectra, and quantum chemical calculations,
Ber. Bunsen-Ges. Phys. Chem., 1977, 81, 826. [all data]
Kroner, et al., 1977
Kroner, J., et al.,
Ber. Bunsen-Gesellschaft Ph. Chem., 1977, 81, 826. [all data]