Benzene, 1-ethyl-4-nitro-
- Formula: C8H9NO2
- Molecular weight: 151.1626
- IUPAC Standard InChIKey: RESTWAHJFMZUIZ-UHFFFAOYSA-N
- CAS Registry Number: 100-12-9
- Chemical structure:
View 3d structure (requires JavaScript / HTML 5) - Other names: p-Ethylnitrobenzene; p-Nitroethylbenzene; p-Nitrophenylethane; 1-Ethyl-4-nitrobenzene; 4-Ethylnitrobenzene; 4-Nitroethylbenzene

Phase change data

Data compiled as indicated in comments:
BS - Robert L. Brown and Stephen E. Stein
AC - William E. Acree, Jr., James S. Chickos
Quantity | Value | Units | Method | Reference | Comment |
---|---|---|---|---|---|
Tboil | 518.7 | K | N/A | Weast and Grasselli, 1989 | BS |
Enthalpy of vaporization
ΔvapH (kJ/mol) | Temperature (K) | Method | Reference | Comment |
---|---|---|---|---|
59.4 | 368. | A | Stephenson and Malanowski, 1987 | Based on data from 353. to 433. K.; AC |

Gas phase ion energetics data

Data compiled by: Sharon G. Lias, John E. Bartmess, Joel F. Liebman, John L. Holmes, Rhoda D. Levin, and W. Gary Mallard
Ionization energy determinations
IE (eV) | Method | Reference |
---|---|---|
9.71 ± 0.03 | EI | Baldwin, Carter, et al., 1982 |

Condensed phase thermochemistry data

Data compiled by: Hussein Y. Afeefy, Joel F. Liebman, and Stephen E. Stein

Quantity Value Units Method Reference Comment
Δfsolid-55.31kJ/molCcbMedard and Thomas, 1957Heat of combustion corrected for pressure
Quantity Value Units Method Reference Comment
Δcsolid-4379.02kJ/molCcbMedard and Thomas, 1957Heat of combustion corrected for pressure

References

Weast and Grasselli, 1989
CRC Handbook of Data on Organic Compounds, 2nd Editon, Weast,R.C and Grasselli, J.G., ed(s)., CRC Press, Inc., Boca Raton, FL, 1989, 1. [all data]
Stephenson and Malanowski, 1987
Stephenson, Richard M.; Malanowski, Stanislaw,
Handbook of the Thermodynamics of Organic Compounds, 1987, https://doi.org/10.1007/978-94-009-3173-2
. [all data]
Baldwin, Carter, et al., 1982
Baldwin, M.A.; Carter, D.M.; Gilmore, J.,
Loss of hydroxyl radical from isomeric ethylnitrobenzenes,
Org. Mass Spectrom., 1982, 17, 45. [all data]