Benzaldehyde, 4-(dimethylamino)-
- Formula: C9H11NO
- Molecular weight: 149.1897
- IUPAC Standard InChIKey: BGNGWHSBYQYVRX-UHFFFAOYSA-N
- CAS Registry Number: 100-10-7
- Chemical structure:
View 3d structure (requires JavaScript / HTML 5) - Other names: Benzaldehyde, p-(dimethylamino)-; p-(Dimethylamino)benzaldehyde; p-(N,N-Dimethylamino)benzaldehyde; p-Formyl-N,N-dimethylaniline; p-Formyldimethylaniline; Ehrlich's reagent; 4-(Dimethylamino)benzaldehyde; 4-Dimethylaminobenzenecarbonal; para-Dimethylaminobenzaldehyde; 4-N,N-Dimethylaminobenzaldehyde; N,N-Dimethyl-p-aminobenzaldehyde; Reagens ehrlichovo; 4-Formyl-N,N-dimethylaniline; N,N-Dimethyl-4-formylaniline; N,N-Dimethyl-4-aminobenzaldehyde; p-DAB; NSC 5517

Condensed phase thermochemistry data

Data compiled by: Hussein Y. Afeefy, Joel F. Liebman, and Stephen E. Stein
Quantity | Value | Units | Method | Reference | Comment |
---|---|---|---|---|---|
ΔfH°solid | -137. | kJ/mol | Ccb | Zavoianu, Contineanu, et al., 1986 | |
Quantity | Value | Units | Method | Reference | Comment |
ΔcH°solid | -4977. | kJ/mol | Ccb | Zavoianu, Contineanu, et al., 1986 | |
ΔcH°solid | -4976.03 ± 0.84 | kJ/mol | Ccb | Young, Keith, et al., 1956 | Reanalyzed by Cox and Pilcher, 1970, Original value = -4974.8 ± 0.8 kJ/mol; see Dzombak, 1956 |

Phase change data

Data compiled as indicated in comments:
BS - Robert L. Brown and Stephen E. Stein
AC - William E. Acree, Jr., James S. Chickos
Quantity | Value | Units | Method | Reference | Comment |
---|---|---|---|---|---|
Tfus | 347. | K | N/A | Buckingham and Donaghy, 1982 | BS |
Reduced pressure boiling point
Tboil (K) | Pressure (bar) | Reference | Comment |
---|---|---|---|
449.7 | 0.023 | Weast and Grasselli, 1989 | BS |
418. | 0.013 | Buckingham and Donaghy, 1982 | BS |
Enthalpy of fusion
ΔfusH (kJ/mol) | Temperature (K) | Reference | Comment |
---|---|---|---|
19.07 | 346.2 | Meng, Liang, et al., 1999 | AC |

Gas phase ion energetics data

Data evaluated as indicated in comments:
HL - Edward P. Hunter and Sharon G. Lias
L - Sharon G. Lias
Data compiled as indicated in comments:
LBLHLM - Sharon G. Lias, John E. Bartmess, Joel F. Liebman, John L. Holmes, Rhoda D. Levin, and W. Gary Mallard
LLK - Sharon G. Lias, Rhoda D. Levin, and Sherif A. Kafafi
Quantity | Value | Units | Method | Reference | Comment |
---|---|---|---|---|---|
IE (evaluated) | 7.3 ± 0.1 | eV | N/A | N/A | L |
Quantity | Value | Units | Method | Reference | Comment |
Proton affinity (review) | 924.8 | kJ/mol | N/A | Hunter and Lias, 1998 | HL |
Quantity | Value | Units | Method | Reference | Comment |
Gas basicity | 898.3 | kJ/mol | N/A | Hunter and Lias, 1998 | HL |
Ionization energy determinations
IE (eV) | Method | Reference | Comment |
---|---|---|---|
7.3 ± 0.1 | PE | Egdell, Green, et al., 1975 | LLK |
7.36 ± 0.02 | PI | Potapov and Iskakov, 1971 | LLK |
7.81 | PE | Gal, Geribaldi, et al., 1985 | Vertical value; LBLHLM |

Kovats' RI, non-polar column, custom temperature program

Column type | Active phase | I | Reference | Comment |
---|---|---|---|---|
Packed | SE-30 | 1528. | Ramsey, Lee, et al., 1980 | He, Chromosorb G HP (80-100 mesh); Column length: 1.5 m; Program: not specified |

Normal alkane RI, non-polar column, temperature ramp

Column type | Active phase | I | Reference | Comment |
---|---|---|---|---|
Capillary | Ultra-1 | 1481. | Okumura, 1991 | 25. m/0.32 mm/0.25 μm, He, 3. K/min; Tstart: 80. C; Tend: 260. C |

Normal alkane RI, non-polar column, custom temperature program

Column type | Active phase | I | Reference | Comment |
---|---|---|---|---|
Capillary | OV-1, SE-30, Methyl silicone, SP-2100, OV-101, DB-1, etc. | 1528. | Waggott and Davies, 1984 | Hydrogen; Column length: 50. m; Column diameter: 0.32 mm; Program: not specified |
Other | Methyl Silicone | 1528. | Ardrey and Moffat, 1981 | Program: not specified |

Normal alkane RI, polar column, custom temperature program

Column type | Active phase | I | Reference | Comment |
---|---|---|---|---|
Capillary | DB-Wax | 2459. | Peng, Yang, et al., 1991 | Program: not specified |

References

Zavoianu, Contineanu, et al., 1986
Zavoianu, D.; Contineanu, I.; Moga-Gheorghe, S.; Marchidan, D.,
Structure and reactivity of nitriles. Condensation reaction of phenylacetonitrile with benzaldehydes,
Rev. Chim. (Bucharest), 1986, 37, 1055-1058. [all data]
Young, Keith, et al., 1956
Young, J.A.; Keith, J.E.; Stehle, P.; Dzombak, W.C.; Hunt, H.,
Heats of combustion of some organic nitrogen compounds,
Ind. Eng. Chem., 1956, 48, 1375-1378. [all data]
Cox and Pilcher, 1970
Cox, J.D.; Pilcher, G.,
Thermochemistry of Organic and Organometallic Compounds, Academic Press, New York, 1970, 1-636. [all data]
Dzombak, 1956
Dzombak, W.C.,
The heats of combustion of some amides and amines, Dissertation Abstr,, 1956, 22-23. [all data]
Buckingham and Donaghy, 1982
Buckingham, J.; Donaghy, S.M.,
Dictionary of Organic Compounds: Fifth Edition, Chapman and Hall, New York, 1982, 1. [all data]
Weast and Grasselli, 1989
CRC Handbook of Data on Organic Compounds, 2nd Editon, Weast,R.C and Grasselli, J.G., ed(s)., CRC Press, Inc., Boca Raton, FL, 1989, 1. [all data]
Meng, Liang, et al., 1999
Meng, Shuang He; Liang, Ping; Tan, Zhi Cheng; Song, Yong Ji; Li, Li; Wang, Lan,
Heat capacity and thermodynamic properties of p-dimethylaminobenzaldehyde,
Thermochimica Acta, 1999, 342, 1-2, 47-51, https://doi.org/10.1016/S0040-6031(99)00315-9
. [all data]
Hunter and Lias, 1998
Hunter, E.P.; Lias, S.G.,
Evaluated Gas Phase Basicities and Proton Affinities of Molecules: An Update,
J. Phys. Chem. Ref. Data, 1998, 27, 3, 413-656, https://doi.org/10.1063/1.556018
. [all data]
Egdell, Green, et al., 1975
Egdell, R.; Green, J.C.; Rao, C.N.R.,
Photoelectron spectra of substituted benzenes,
Chem. Phys. Lett., 1975, 33, 600. [all data]
Potapov and Iskakov, 1971
Potapov, V.K.; Iskakov, L.I.,
Electronic structure and photoionization of aromatic amines,
High Energy Chem., 1971, 5, 237, In original 264. [all data]
Gal, Geribaldi, et al., 1985
Gal, J.-F.; Geribaldi, S.; Pfister-Guillouzo, G.; Morris, D.G.,
Basicity of the carbonyl group. Part 12. Correlations between ionization potentials and lewis basicities in aromatic carbonyl compounds,
J. Chem. Soc. Perkin Trans. 2, 1985, 103. [all data]
Lang (editor), 1972
Lang (editor), L.,
Absorption Spectra in the Ultraviolet and Visible Region, 1972, 17, 37. [all data]
Ramsey, Lee, et al., 1980
Ramsey, J.D.; Lee, T.D.; Osselton, M.D.; Moffat, A.C.,
Gas-liquid chromatographic retention indices of 296 non-drug substances on SE-30 or OV-1 likely to be encountered in toxicological analyses,
J. Chromatogr., 1980, 184, 2, 185-206, https://doi.org/10.1016/S0021-9673(00)85641-1
. [all data]
Okumura, 1991
Okumura, T.,
retention indices of environmental chemicals on methyl silicone capillary column,
Journal of Environmental Chemistry (Japan), 1991, 1, 2, 333-358, https://doi.org/10.5985/jec.1.333
. [all data]
Waggott and Davies, 1984
Waggott, A.; Davies, I.W.,
Identification of organic pollutants using linear temperature programmed retention indices (LTPRIs) - Part II, 1984, retrieved from http://dwi.defra.gov.uk/research/completed-research/reports/dwi0383.pdf. [all data]
Ardrey and Moffat, 1981
Ardrey, R.E.; Moffat, A.C.,
Gas-liquid chromatographic retention indices of 1318 substances of toxicological interest on SE-30 or OV-1 stationary phase,
J. Chromatogr., 1981, 220, 3, 195-252, https://doi.org/10.1016/S0021-9673(00)81925-1
. [all data]
Peng, Yang, et al., 1991
Peng, C.T.; Yang, Z.C.; Ding, S.F.,
Prediction of rentention idexes. II. Structure-retention index relationship on polar columns,
J. Chromatogr., 1991, 586, 1, 85-112, https://doi.org/10.1016/0021-9673(91)80028-F
. [all data]