2,3-Pentadiene, 2,4-dimethyl-
- Formula: C7H12
- Molecular weight: 96.1702
- IUPAC Standard InChIKey: DZSNJASVIURWOG-UHFFFAOYSA-N
- CAS Registry Number: 1000-87-9
- Chemical structure:
View 3d structure (requires JavaScript / HTML 5) - Other names: (CH3)2C=C=C(CH3)2; Allene, tetramethyl-; Tetramethylallene; 1,1,3,3-Tetramethylallene; 2,4-Dimethyl-2,3-pentadiene; 2,4-dimethylpenta-2,3-diene

Phase change data

Data compiled by: Thermodynamics Research Center, NIST Boulder Laboratories, Chris Muzny director
Quantity | Value | Units | Method | Reference | Comment |
---|---|---|---|---|---|
Tboil | 356. | K | N/A | Zakharova, 1947 | Uncertainty assigned by TRC = 3. K |
Tboil | 356. | K | N/A | Slobodin, 1936 | Uncertainty assigned by TRC = 4. K |

Gas phase ion energetics data

Data compiled by: Sharon G. Lias, Rhoda D. Levin, and Sherif A. Kafafi
Ionization energy determinations
IE (eV) | Method | Reference | Comment |
---|---|---|---|
8.53 | PE | Hill, Ward, et al., 1979 | Vertical value |
8.47 | PE | Brogli, Crandall, et al., 1973 | Vertical value |

References

Zakharova, 1947
Zakharova, A.I.,
Zh. Obshch. Khim., 1947, 17, 1277. [all data]
Slobodin, 1936
Slobodin, Ya.M.,
Isomerization of Allene Hydrocarbons with SIlicates. III. Isomerization of Tetramethyl allene,
J. Gen. Chem. (U.S.S.R.), 1936, 6, 1806-14. [all data]
Hill, Ward, et al., 1979
Hill, W.E.; Ward, C.H.; Webb, T.R.; Worley, S.D.,
Electronic structures of (alkene)iron tetracarbonyl compounds,
Inorg. Chem., 1979, 18, 2029. [all data]
Brogli, Crandall, et al., 1973
Brogli, F.; Crandall, J.K.; Heilbronner, E.; Kloster-Jensen, E.; Sojka, S.A.,
The photoelectron spectra of methyl-substituted allenes and of tetramethyl-bisallenyl,
J. Electron Spectrosc. Relat. Phenom., 1973, 2, 455. [all data]