CH3SiH
- Formula: CH4Si
- Molecular weight: 44.1280

Reaction thermochemistry data

Data compiled by: Michael M. Meot-Ner (Mautner) and Sharon G. Lias
Individual Reactions
By formula: Fe+ + CH4Si = (Fe+ • CH4Si)
Quantity | Value | Units | Method | Reference | Comment |
---|---|---|---|---|---|
ΔrH° | 67. ± 11. | kcal/mol | ICR | Jacobson and Bakhtiar, 1993 | gas phase |

Ion clustering data

Data compiled by: Michael M. Meot-Ner (Mautner) and Sharon G. Lias
Clustering reactions
By formula: Fe+ + CH4Si = (Fe+ • CH4Si)
Quantity | Value | Units | Method | Reference | Comment |
---|---|---|---|---|---|
ΔrH° | 67. ± 11. | kcal/mol | ICR | Jacobson and Bakhtiar, 1993 | gas phase |

Vibrational and/or electronic energy levels

Data compiled by: Marilyn E. Jacox
State: ?
Energy (cm-1) |
Med. | Transition | λmin (nm) |
λmax (nm) |
References | ||
---|---|---|---|---|---|---|---|
Txd = 30300 | N2 | Reisenauer, Mihm, et al., 1982 | |||||
Maier, Mihm, et al., 1984 | |||||||
State: ?
Energy (cm-1) |
Med. | Transition | λmin (nm) |
λmax (nm) |
References | ||
---|---|---|---|---|---|---|---|
Txd = 20800 | Ar | Reisenauer, Mihm, et al., 1982 | |||||
Maier, Mihm, et al., 1984 | |||||||
State: X
Vib. sym. |
No. | Approximate type of mode |
cm-1 | Med. | Method | References | |
---|---|---|---|---|---|---|---|
2004 | m | Ar | IR | Reisenauer, Mihm, et al., 1982 Maier, Mihm, et al., 1984 | |||
1986 | w | N2 | IR | Reisenauer, Mihm, et al., 1982 Maier, Mihm, et al., 1984 | |||
1978 | w | N2 | IR | Reisenauer, Mihm, et al., 1982 Maier, Mihm, et al., 1984 | |||
1971 | m | N2 | IR | Reisenauer, Mihm, et al., 1982 Maier, Mihm, et al., 1984 | |||
1935 | w | Ar | IR | Reisenauer, Mihm, et al., 1982 Maier, Mihm, et al., 1984 | |||
Additional references: Jacox, 1994, page 309

References

Jacobson and Bakhtiar, 1993
Jacobson, D.B.; Bakhtiar, R.,
Generation, Characterization and Properties of Iron-Silylene and Iron-Sylene Cationic Complexes in the Gas Phase,
J. Am. Chem. Soc., 1993, 115, 23, 10830, https://doi.org/10.1021/ja00076a046
. [all data]
Reisenauer, Mihm, et al., 1982
Reisenauer, H.P.; Mihm, G.; Maier, G.,
Reversible Photoisomerisierung zwischen Silaethenen und Methylsilylenen (Methylsilandiylen),
Angew. Chem., 1982, 94, 11, 864, https://doi.org/10.1002/ange.19820941110
. [all data]
Maier, Mihm, et al., 1984
Maier, G.; Mihm, G.; Reisenauer, H.P.; Littmann, D.,
Hetero-π-Systeme, 9. Über die Beziehungen zwischen Silaethenen und Methylsilylenen,
Chem. Ber., 1984, 117, 7, 2369, https://doi.org/10.1002/cber.19841170709
. [all data]
Jacox, 1994
Jacox, M.E.,
Vibrational and electronic energy levels of polyatomic transient molecules, American Chemical Society, Washington, DC, 1994, 464. [all data]