LaF3..F anion
- Formula: F4La-
- Molecular weight: 214.89963

Gas phase thermochemistry data

Data compiled by: John E. Bartmess
Quantity | Value | Units | Method | Reference | Comment |
---|---|---|---|---|---|
ΔfH°gas | -1998. ± 33. | kJ/mol | TDEq | Gusarov, Gorokhov, et al., 1979 | value altered from reference due to conversion from electron convention to ion convention |

Vibrational and/or electronic energy levels

Data compiled by: Marilyn E. Jacox
State: X
Vib. sym. |
No. | Approximate type of mode |
cm-1 | Med. | Method | References | |
---|---|---|---|---|---|---|---|
f2 | 3 | Asym. stretch | 417.8 | Ar | IR | Wang and Andrews, 2010 | |

References

Gusarov, Gorokhov, et al., 1979
Gusarov, A.V.; Gorokhov, L.N.; Pyatenko, A.T.; Sidorova, I.V.,
Negative ions in the vapors of inorganic compounds,
Adv. Mass Spectrom., 1979, 8, 262. [all data]
Wang and Andrews, 2010
Wang, X.; Andrews, L.,
Infrared Spectra of MF,
J. Phys. Chem. A, 2010, 114, 6, 2293, https://doi.org/10.1021/jp910936d
. [all data]