F2NCuF

Vibrational and/or electronic energy levels

Data compiled by: Marilyn E. Jacox

State:   X

Vib.
sym.
 No.   Approximate
 type of mode
 cm-1   Med.   Method   References

a1 1 NF2 s-stretch 1094.3 Ne IR Gong and Andrews, 2012
1 NF2 s-stretch 1090.5 Ar IR Gong and Andrews, 2012
2 Cu-F stretch 678.4 Ar IR Gong and Andrews, 2012
3 NF2 scissor 597.5 Ar IR Gong and Andrews, 2012
b2 5 NF2 a-stretch 988.2 Ne IR Gong and Andrews, 2012
5 NF2 a-stretch 985.0 Ar IR Gong and Andrews, 2012

References

Gong and Andrews, 2012
Gong, Y.; Andrews, L., Matrix Infrared Spectroscopic and Theoretical of the Difluoroamino Metal Fluoride Molecules: F, Inorg. Chem., 2012, 51, 1, 667, https://doi.org/10.1021/ic2021758 . [all data]