C6D5CO
- Formula: C7D5O
- Molecular weight: 110.1448

Vibrational and/or electronic energy levels

Data compiled by: Marilyn E. Jacox
State: X
Vib. sym. |
No. | Approximate type of mode |
cm-1 | Med. | Method | References | |
---|---|---|---|---|---|---|---|
a' | C=O stretch | 1815.8 | vs | Ar | IR | Mardyukov and Sander | |
C=C stretch | 1556.8 | w | Ar | IR | Mardyukov and Sander | ||
C=C stretch | 1550.0 | w | Ar | IR | Mardyukov and Sander | ||
1356.3 | w | Ar | IR | Mardyukov and Sander | |||
1327.1 | w | Ar | IR | Mardyukov and Sander | |||
1297.0 | w | Ar | IR | Mardyukov and Sander | |||
1100.1 | m | Ar | IR | Mardyukov and Sander | |||
959.6 | w | Ar | IR | Mardyukov and Sander | |||
866.6 | w | Ar | IR | Mardyukov and Sander | |||
845.5 | w | Ar | IR | Mardyukov and Sander | |||
831.5 | w m | Ar | IR | Mardyukov and Sander | |||
817.2 | w | Ar | IR | Mardyukov and Sander | |||
749.3 | w | Ar | IR | Mardyukov and Sander | |||
603.7 | w m | Ar | IR | Mardyukov and Sander | |||
587.0 | w | Ar | IR | Mardyukov and Sander | |||
a | 765.1 | w | Ar | IR | Mardyukov and Sander | ||
624.9 | w | Ar | IR | Mardyukov and Sander | |||
CD deformation | 545.5 | w m | Ar | IR | Mardyukov and Sander | ||

References

Mardyukov and Sander
Mardyukov, A.; Sander, W.,
Eur. J. Org. Chem. 2010, 2904.. [all data]