BrCO

Vibrational and/or electronic energy levels

Data compiled by: Marilyn E. Jacox

State:   X

Vib.
sym.
 No.   Approximate
 type of mode
 cm-1   Med.   Method   References

a' 1 CO stretch 1902 T gas IR Lin and Lee, 2012

References

Lin and Lee, 2012
Lin, S.-Y.; Lee, Y.-P., Infrared Absorption of Gaseous Benzoyl Radical C, J. Phys. Chem. A, 2012, 116, 24, 6366, https://doi.org/10.1021/jp2120934 . [all data]