(N3)3PS

Vibrational and/or electronic energy levels

Data compiled by: Marilyn E. Jacox

State:   X

Vib.
sym.
 No.   Approximate
 type of mode
 cm-1   Med.   Method   References

a 1 N3 a-stretch 2186 w s gas IR Zeng, Bernhardt, et al., 2011
1 N3 a-stretch 2181.6 m Ar IR Zeng, Bernhardt, et al., 2011
2 N3 s-stretch 1271 s gas IR Zeng, Bernhardt, et al., 2011
2 N3 s-stretch 1279.7 w Ar IR Zeng, Bernhardt, et al., 2011
3 Mixed 831 s gas IR Zeng, Bernhardt, et al., 2011
3 Mixed 834.1 s Ar IR Zeng, Bernhardt, et al., 2011
4 Mixed 651.4 w Ar IR Zeng, Bernhardt, et al., 2011
5 N3 deform. 577 w gas IR Zeng, Bernhardt, et al., 2011
5 N3 deform. 578.1 w Ar IR Zeng, Bernhardt, et al., 2011
e 10 N3 a-stretch 2162 vs gas IR Zeng, Bernhardt, et al., 2011
10 N3 a-stretch 2163.3 Ar IR Zeng, Bernhardt, et al., 2011
11 N3 s-stretch 1246 vs gas IR Zeng, Bernhardt, et al., 2011
11 N3 s-stretch 1240.7 vs Ar IR Zeng, Bernhardt, et al., 2011
12 PN3 a-stretch 763 s gas IR Zeng, Bernhardt, et al., 2011
12 PN3 a-stretch 768.3 s Ar IR Zeng, Bernhardt, et al., 2011
13 N3 deform. 598 w gas IR Zeng, Bernhardt, et al., 2011
13 N3 deform. 609.4 m Ar IR Zeng, Bernhardt, et al., 2011
14 N3 deform. 555.0 w Ar IR Zeng, Bernhardt, et al., 2011

References

Zeng, Bernhardt, et al., 2011
Zeng, X.; Bernhardt, E.; Beckers, H.; Willner, H., Synthesis and Characterization of the Phosphorus Triazides OP(N, Inorg. Chem., 2011, 50, 21, 11235, https://doi.org/10.1021/ic201802x . [all data]