D5+

Vibrational and/or electronic energy levels

Data compiled by: Marilyn E. Jacox

State:   X

Vib.
sym.
 No.   Approximate
 type of mode
 cm-1   Med.   Method   References

2 2546 gas PF Cheng, Bandyopadyay, et al., 2010

References

Cheng, Bandyopadyay, et al., 2010
Cheng, T.C.; Bandyopadyay, B.; Wang, Y.; Carter, S.; Braams, B.J.; Bowman, J.M.; Duncan, M.A., Shared-Proton Mode Lights up the Infrared Spectrum of Fluxional Cations H, J. Phys. Chem. Lett., 2010, 1, 4, 758, https://doi.org/10.1021/jz100048v . [all data]