c-FPNF

Vibrational and/or electronic energy levels

Data compiled by: Marilyn E. Jacox

State:   X

Vib.
sym.
 No.   Approximate
 type of mode
 cm-1   Med.   Method   References

a' 1 PN stretch 1116.8 w m Ar IR Zeng, Beckers, et al., 2009
2 PF stretch 826.5 vs Ar IR Zeng, Beckers, et al., 2009
3 NF stretch 795.2 m Ar IR Zeng, Beckers, et al., 2009
4 Deformation 517.7 w m Ar IR Zeng, Beckers, et al., 2009
a 6 Torsion 351.3 w m Ar IR Zeng, Beckers, et al., 2009

References

Zeng, Beckers, et al., 2009
Zeng, X.; Beckers, H.; Willner, H., Difluoro-λ, Angew. Chem. Int. Ed., 2009, 48, 26, 4828, https://doi.org/10.1002/anie.200901380 . [all data]