SWO2-

Vibrational and/or electronic energy levels

Data compiled by: Marilyn E. Jacox

State:   X

Vib.
sym.
 No.   Approximate
 type of mode
 cm-1   Med.   Method   References

b2 5 WO2 a-stretch 904.5 Ne IR Wang and Andrews, 2009
5 WO2 a-stretch 903.6 Ar IR Wang and Andrews, 2009

References

Wang and Andrews, 2009
Wang, X.; Andrews, L., Infrared Spectra and Density Functional Calculations for SMO, J. Phys. Chem. A, 2009, 113, 31, 8934, https://doi.org/10.1021/jp9033408 . [all data]