t-HNOH

Vibrational and/or electronic energy levels

Data compiled by: Marilyn E. Jacox

State:   X

Vib.
sym.
 No.   Approximate
 type of mode
 cm-1   Med.   Method   References

a' 4 Deformation 1241.7 H2 IR Wu, Lin, et al., 2009
5 NO stretch 1063.5 H2 IR Wu, Lin, et al., 2009
a 6 Torsion 726.2 H2 IR Wu, Lin, et al., 2009

References

Wu, Lin, et al., 2009
Wu, Y.-J.; Lin, M.-Y.; Hsu, S.-C.; Cheng, B.-M., Infrared Absorption Spectra of, ChemPhysChem, 2009, 10, 6, 901, https://doi.org/10.1002/cphc.200800775 . [all data]