t-,c-CH3OCOH
- Formula: C2H4O2
- Molecular weight: 60.0520

Vibrational and/or electronic energy levels

Data compiled by: Marilyn E. Jacox
State: X
Vib. sym. |
No. | Approximate type of mode |
cm-1 | Med. | Method | References | |
---|---|---|---|---|---|---|---|
a' | OH stretch | 3629.4 | s | Ar | IR | Schreiner and Reisenauer, 2008 | |
CH stretch | 3010.7 | Ar | IR | Schreiner and Reisenauer, 2008 | |||
CH stretch | 2965.8 | Ar | IR | Schreiner and Reisenauer, 2008 | |||
CH stretch | 2918.9 | Ar | IR | Schreiner and Reisenauer, 2008 | |||
CH stretch | 2861.4 | Ar | IR | Schreiner and Reisenauer, 2008 | |||
CH3 deform. | 1467.0 | Ar | IR | Schreiner and Reisenauer, 2008 | |||
CH3 deform. | 1455.5 | Ar | IR | Schreiner and Reisenauer, 2008 | |||
Deformation | 1337.8 | Ar | IR | Schreiner and Reisenauer, 2008 | |||
CO stretch | 1189.3 | Ar | IR | Schreiner and Reisenauer, 2008 | |||
CO stretch | 1128.6 | Ar | IR | Schreiner and Reisenauer, 2008 | |||
HCO deform. | 1089.9 | Ar | IR | Schreiner and Reisenauer, 2008 | |||
a | CH3 d | eform. | 1442.8 | Ar | IR | Schreiner and Reisenauer, 2008 | |
eform. | 1439.4 | Ar | IR | Schreiner and Reisenauer, 2008 | |||
OH twist | 654.2 | Ar | IR | Schreiner and Reisenauer, 2008 | |||

References

Schreiner and Reisenauer, 2008
Schreiner, P.R.; Reisenauer, H.P.,
Spectroscopic Identification of Dihydroxycarbene,
Angew. Chem. Int. Ed., 2008, 47, 37, 7071, https://doi.org/10.1002/anie.200802105
. [all data]