br-Pb2H2

Vibrational and/or electronic energy levels

Data compiled by: Marilyn E. Jacox

State:   X

Vib.
sym.
 No.   Approximate
 type of mode
 cm-1   Med.   Method   References

b1 PbHPb stretch 978.2 H2 IR Wang and Andrews, 2003
b2 PbHPb stretch 789.4 H2 IR Wang and Andrews, 2003

References

Wang and Andrews, 2003
Wang, X.; Andrews, L., Infrared Spectra of Group 14 Hydrides in Solid Hydrogen: Experimental Observation of PbH, J. Am. Chem. Soc., 2003, 125, 21, 6581, https://doi.org/10.1021/ja029862l . [all data]