CH3C(O)SeH

Vibrational and/or electronic energy levels

Data compiled by: Marilyn E. Jacox

State:   C

 Energy
 (cm-1
 Med.   Transition   λmin
 (nm)
 λmax
 (nm)

References

Tx = 50000 gas C-X Gomez Castano, Romano, et al., 2008

State:   B

 Energy
 (cm-1
 Med.   Transition   λmin
 (nm)
 λmax
 (nm)

Tx = 42740 gas B-X Gomez Castano, Romano, et al., 2008

State:   A

 Energy
 (cm-1
 Med.   Transition   λmin
 (nm)
 λmax
 (nm)

Tx = 20410 gas A-X Gomez Castano, Romano, et al., 2008

State:   X

Vib.
sym.
 No.   Approximate
 type of mode
 cm-1   Med.   Method   References

CH3 a-stretch 3013 gas IR Gomez Castano, Romano, et al., 2008
CH3 a-stretch 3016.1 w Ar IR Gomez Castano, Romano, et al., 2008
CH3 a-stretch 3014.1 w Ar IR Gomez Castano, Romano, et al., 2008
CH3 a-stretch 2945 gas IR Gomez Castano, Romano, et al., 2008
CH3 a-stretch 2984.8 w Ar IR Gomez Castano, Romano, et al., 2008
CH3 a-stretch 2965.3 w Ar IR Gomez Castano, Romano, et al., 2008
CH3 s-stretch 2854 gas IR Gomez Castano, Romano, et al., 2008
CH3 s-stretch 2930.0 Ar IR Gomez Castano, Romano, et al., 2008
SeH stretch 2336 gas IR Gomez Castano, Romano, et al., 2008
SeH stretch 2325 gas IR Gomez Castano, Romano, et al., 2008
SeH stretch 2301.4 w Ar IR Gomez Castano, Romano, et al., 2008
SeH stretch 2293.6 w Ar IR Gomez Castano, Romano, et al., 2008
CO stretch 1758 gas IR Gomez Castano, Romano, et al., 2008
CO stretch 1746.6 vs Ar IR Gomez Castano, Romano, et al., 2008
CO stretch 1740.9 m Ar IR Gomez Castano, Romano, et al., 2008
CH3 twist 1444 gas IR Gomez Castano, Romano, et al., 2008
CH3 twist 1436 gas IR Gomez Castano, Romano, et al., 2008
CH3 twist 1446.2 w Ar IR Gomez Castano, Romano, et al., 2008
CH3 twist 1439.4 w Ar IR Gomez Castano, Romano, et al., 2008
CH3 deform. 1422 gas IR Gomez Castano, Romano, et al., 2008
CH3 deform. 1423.4 w Ar IR Gomez Castano, Romano, et al., 2008
CH3 deform. 1421.9 w m Ar IR Gomez Castano, Romano, et al., 2008
CH3 wag 1362 gas IR Gomez Castano, Romano, et al., 2008
CH3 wag 1350 gas IR Gomez Castano, Romano, et al., 2008
CH3 wag 1351.2 w m Ar IR Gomez Castano, Romano, et al., 2008
CH3 wag 1349.7 w Ar IR Gomez Castano, Romano, et al., 2008
HCC deform. 1110 gas IR Gomez Castano, Romano, et al., 2008
HCC deform. 1105.8 s Ar IR Gomez Castano, Romano, et al., 2008
CH3 rock 1006 gas IR Gomez Castano, Romano, et al., 2008
CH3 rock 985.6 w Ar IR Gomez Castano, Romano, et al., 2008
CH3 rock 982.6 w Ar IR Gomez Castano, Romano, et al., 2008
CC stretch 953 gas IR Gomez Castano, Romano, et al., 2008
CC stretch 950.2 w m Ar IR Gomez Castano, Romano, et al., 2008
CC stretch 945.9 w m Ar IR Gomez Castano, Romano, et al., 2008
HSeC deform. 730 gas IR Gomez Castano, Romano, et al., 2008
HSeC deform. 743.4 w Ar IR Gomez Castano, Romano, et al., 2008
HSeC deform. 727.1 w Ar IR Gomez Castano, Romano, et al., 2008
CSe stretch 575 gas IR Gomez Castano, Romano, et al., 2008
CSe stretch 575.6 w m Ar IR Gomez Castano, Romano, et al., 2008
CSe stretch 569.1 w Ar IR Gomez Castano, Romano, et al., 2008

Gomez Castano, Romano, et al., 2008
Gomez Castano, J.A.; Romano, R.M.; Beckers, H.; Willner, H.; Boese, R.; Della Vedova, C.O., Selenoacetic Acid, CH, Angew. Chem. Int. Ed., 2008, 47, 52, 10114, https://doi.org/10.1002/anie.200803513 . [all data]