cyc-C(Ce2)O

Vibrational and/or electronic energy levels

Data compiled by: Marilyn E. Jacox

State:   X

Vib.
sym.
 No.   Approximate
 type of mode
 cm-1   Med.   Method   References

CeC stretch 644.5 Ar IR Zhou, Jin, et al., 2006
Ring deform. 593.8 w T Ar IR Zhou, Jin, et al., 2006
CeO stretch 507.6 Ar IR Zhou, Jin, et al., 2006

References

Zhou, Jin, et al., 2006
Zhou, M.; Jin, X.; Li, J., Reactions of Cerium Atoms and Dicerium Molecules with CO: Formation of Cerium Carbonyls and Photoconversion to CO-Activated Insertion Molecules, J. Phys. Chem. A, 2006, 110, 34, 10206, https://doi.org/10.1021/jp062073w . [all data]