Sc(OH)2

Vibrational and/or electronic energy levels

Data compiled by: Marilyn E. Jacox

State:   X

Vib.
sym.
 No.   Approximate
 type of mode
 cm-1   Med.   Method   References

a1 1 OH s-stretch 3782.5 Ar IR Wang and Andrews, 2006
b2 7 OH a-stretch 3780.8 Ar IR Wang and Andrews, 2006
8 ScO2 a-stretch 729.6 Ar IR Wang and Andrews, 2006

References

Wang and Andrews, 2006
Wang, X.; Andrews, L., Infrared Spectra and Density Functional Calculations for the Sc(OH), J. Phys. Chem. A, 2006, 110, 5, 1850, https://doi.org/10.1021/jp056518c . [all data]