ICN+2

Vibrational and/or electronic energy levels

Data compiled by: Marilyn E. Jacox

State:   a

 Energy
 (cm-1
 Med.   Transition   λmin
 (nm)
 λmax
 (nm)

References

To = 5130 ± 40 gas Eland, 2006

Vib.
sym.
 No.   Approximate
 type of mode
 cm-1   Med.   Method   References

Σ+ 1 CN stretch 1660 ± 40 gas PE Eland, 2006

State:   X

Vib.
sym.
 No.   Approximate
 type of mode
 cm-1   Med.   Method   References

Σ+ 1 CN stretch 1475 ± 40 gas PE Eland, 2006

Eland, 2006
Eland, J.H.D., and R. Feifel, 2006, Chem. Phys. 327, 85. [all data]