Eu(OH)2

Vibrational and/or electronic energy levels

Data compiled by: Marilyn E. Jacox

State:   X

Vib.
sym.
 No.   Approximate
 type of mode
 cm-1   Med.   Method   References

EuO2 s-stretch 487.1 Ar IR Xu and Zhou, 2006
EuO2 a-stretch 461.7 Ar IR Xu and Zhou, 2006

References

Xu and Zhou, 2006
Xu, J.; Zhou, M., Reactions of Early Lanthanide Metal Atoms (Nd, Sm, Eu) with Water Molecules. A Matrix Isolation Infrared Spectroscopic and Theoretical Study, J. Phys. Chem. A, 2006, 110, 36, 10575, https://doi.org/10.1021/jp063776g . [all data]