CH2=NbH2

Vibrational and/or electronic energy levels

Data compiled by: Marilyn E. Jacox

State:   X

Vib.
sym.
 No.   Approximate
 type of mode
 cm-1   Med.   Method   References

NbH2 stretch 1680.7 Ar IR Cho and Andrews, 2006
NbH2 stretch 1952.5 Ar IR Cho and Andrews, 2006
C=Nb stretch 805.4 Ar IR Cho and Andrews, 2006
CH2 deform. 547.1 Ar IR Cho and Andrews, 2006
Torsion 480.4 Ar IR Cho and Andrews, 2006

References

Cho and Andrews, 2006
Cho, H.-G.; Andrews, L., Methane Activation by Laser-Ablated V, Nb, and Ta Atoms: Formation of CH, J. Phys. Chem. A, 2006, 110, 11, 3886, https://doi.org/10.1021/jp057029f . [all data]