(SnCO)2
- Formula: C2O2Sn2
- Molecular weight: 293.440

Vibrational and/or electronic energy levels

Data compiled by: Marilyn E. Jacox
State: X
Vib. sym. |
No. | Approximate type of mode |
cm-1 | Med. | Method | References | |
---|---|---|---|---|---|---|---|
bu | CO a-stretch | 1959.2 | Ar | IR | Jiang and Xu, 2006 | ||

References

Jiang and Xu, 2006
Jiang, L.; Xu, Q.,
Reactions of the Small Tin Clusters with Carbon Monoxide: Infrared Spectra and DFT Calculations of the SnnCO (n = 2--5) and Sn2(CO)2 Molecules in Solid Argon,
Bull. Chem. Soc. Japan, 2006, 79, 6, 857, https://doi.org/10.1246/bcsj.79.857
. [all data]