(GeCO)2

Vibrational and/or electronic energy levels

Data compiled by: Marilyn E. Jacox

State:   X

Vib.
sym.
 No.   Approximate
 type of mode
 cm-1   Med.   Method   References

bu CO a-stretch 1935.0 Ar IR Zhou, Jiang, et al., 2005

References

Zhou, Jiang, et al., 2005
Zhou, M.; Jiang, L.; Xu, Q., Reactions of Germanium Atoms and Small Clusters with CO: Experimental and Theoretical Characterization of Ge, J. Phys. Chem. A, 2005, 109, 15, 3325, https://doi.org/10.1021/jp044528s . [all data]