Zr(OD)2

Vibrational and/or electronic energy levels

Data compiled by: Marilyn E. Jacox

State:   X

Vib.
sym.
 No.   Approximate
 type of mode
 cm-1   Med.   Method   References

b2 7 OD stretch 2784.5 Ar IR Wang and Andrews, 2005
8 ZrO stretch 638.0 Ar IR Wang and Andrews, 2005

References

Wang and Andrews, 2005
Wang, X.; Andrews, L., Infrared Spectra and Structures for Group 4 Dihydroxide and Tetrahydroxide Molecules, J. Phys. Chem. A, 2005, 109, 47, 10689, https://doi.org/10.1021/jp054482i . [all data]