SiH3NiH

Vibrational and/or electronic energy levels

Data compiled by: Marilyn E. Jacox

State:   X

Vib.
sym.
 No.   Approximate
 type of mode
 cm-1   Med.   Method   References

a' 1 SiH s-stretch 2096.4 s Ar IR Himmel, 2004
2 Mixed 2024.1 s Ar IR Himmel, 2004
4 SiH3 deform. 945 s Ar IR Himmel, 2004
6 Mixed 505.6 w Ar IR Himmel, 2004
7 SiNiH deform. 353.8 w Ar IR Himmel, 2004
a 9 SiH3 a-stretch 2121.3 s Ar IR Himmel, 2004
10 Mixed 859.4 w Ar IR Himmel, 2004

References

Himmel, 2004
Himmel, H.-J., A Comparison of the Reactivity of Ni Atoms Toward CH4, SiH4, and SnH4: A Combined Matrix Isolation and Quantum-Chemical Study, Chem. Eur. J., 2004, 10, 11, 2851, https://doi.org/10.1002/chem.200305763 . [all data]