Pb(OH)4

Vibrational and/or electronic energy levels

Data compiled by: Marilyn E. Jacox

State:   X

Vib.
sym.
 No.   Approximate
 type of mode
 cm-1   Med.   Method   References

e OH stretch 3607.5 Ar IR Wang and Andrews, 2005
PbOH bend 899.3 Ar IR Wang and Andrews, 2005
PbO stretch 556.6 Ar IR Wang and Andrews, 2005

References

Wang and Andrews, 2005
Wang, X.; Andrews, L., Infrared Spectra of M(OH), J. Phys. Chem. A, 2005, 109, 40, 9013, https://doi.org/10.1021/jp053420p . [all data]