DTi(O)OD

Vibrational and/or electronic energy levels

Data compiled by: Marilyn E. Jacox

State:   X

Vib.
sym.
 No.   Approximate
 type of mode
 cm-1   Med.   Method   References

Ti=O stretch 1003.8 Ar IR Wang and Andrews, 2005
TiO stretch 723.5 Ar IR Wang and Andrews, 2005

References

Wang and Andrews, 2005
Wang, X.; Andrews, L., Infrared Spectra and Structures for Group 4 Dihydroxide and Tetrahydroxide Molecules, J. Phys. Chem. A, 2005, 109, 47, 10689, https://doi.org/10.1021/jp054482i . [all data]