DBF

Vibrational and/or electronic energy levels

Data compiled by: Marilyn E. Jacox

State:   A

 Energy
 (cm-1
 Med.   Transition   λmin
 (nm)
 λmax
 (nm)

References

T = 15115.03 gas A-X 610 712 Sunahori and Clouthier, 2009

State:   X

Vib.
sym.
 No.   Approximate
 type of mode
 cm-1   Med.   Method   References

a' 1 BD stretch 1818.5 gas LF Sunahori and Clouthier, 2009
2 Bend 770.3 gas LF He, Sunahori, et al., 2005
Sunahori and Clouthier, 2009
3 BF stretch 1295.4 gas LF He, Sunahori, et al., 2005
Sunahori and Clouthier, 2009

Sunahori and Clouthier, 2009
Sunahori, F.X.; Clouthier, D.J., The electronic spectrum of the fluoroborane free radical. II. Analysis of laser-induced fluorescence and single vibronic level emission spectra, J. Chem. Phys., 2009, 130, 16, 164310, https://doi.org/10.1063/1.3122031 . [all data]

He, Sunahori, et al., 2005
He, S.-G.; Sunahori, F.X.; Clouthier, D.J., A Family of New Boron-Containing Free Radicals, J. Am. Chem. Soc., 2005, 127, 31, 10814, https://doi.org/10.1021/ja053736a . [all data]