CH2=HfH2

Vibrational and/or electronic energy levels

Data compiled by: Marilyn E. Jacox

State:   X

Vib.
sym.
 No.   Approximate
 type of mode
 cm-1   Med.   Method   References

HfH2 s-stretch 1653.5 Ne IR Cho, Wang, et al., 2005
HfH2 s-stretch 1614.2 Ar IR Cho, Wang, et al., 2005
HfH2 a-stretch 1616.3 Ne IR Cho, Wang, et al., 2005
HfH2 a-stretch 1563.6 Ar IR Cho, Wang, et al., 2005
C=Hf stretch 773.4 Ne IR Cho, Wang, et al., 2005
C=Hf stretch 766.3 Ar IR Cho, Wang, et al., 2005
CH2 wag 665.8 Ar IR Cho, Wang, et al., 2005
HfH2 bend 632.6 Ar IR Cho, Wang, et al., 2005

References

Cho, Wang, et al., 2005
Cho, H.-G.; Wang, X.; Andrews, L., Reactions of Methane with Hafnium Atoms: CH, Organomet., 2005, 24, 12, 2854, https://doi.org/10.1021/om050069l . [all data]