C4Cl

Vibrational and/or electronic energy levels

Data compiled by: Marilyn E. Jacox

State:   2 2Π

 Energy
 (cm-1
 Med.   Transition   λmin
 (nm)
 λmax
 (nm)

References

To = 23419 ± 12 Ne 2 2Π-X 390 430 van Wijngaarden, Shnitko, et al., 2005

Vib.
sym.
 No.   Approximate
 type of mode
 cm-1   Med.   Method   References

Σ+ 1 1975 ± 15 Ne AB van Wijngaarden, Shnitko, et al., 2005
4 459 ± 15 Ne AB van Wijngaarden, Shnitko, et al., 2005
5 CCl stretch 317 ± 15 Ne AB van Wijngaarden, Shnitko, et al., 2005

State:   X

Vib.
sym.
 No.   Approximate
 type of mode
 cm-1   Med.   Method   References

Σ+ 1 2022.1 Ne IR van Wijngaarden, Shnitko, et al., 2005

Additional references: Sumiyoshi, Katoh, et al., 2005

van Wijngaarden, Shnitko, et al., 2005
van Wijngaarden, J.; Shnitko, I.; Batalov, A.; Kolek, P.; Fulara, J.; Maier, J.P., Electronic Absorption Spectra of C, J. Phys. Chem. A, 2005, 109, 25, 5553, https://doi.org/10.1021/jp051514t . [all data]

Sumiyoshi, Katoh, et al., 2005
Sumiyoshi, Y.; Katoh, K.; Endo, Y., Rotational spectra of the CCCCCl radical, Chem. Phys. Lett., 2005, 414, 1-3, 82, https://doi.org/10.1016/j.cplett.2005.08.054 . [all data]