Au(OH)2

Vibrational and/or electronic energy levels

Data compiled by: Marilyn E. Jacox

State:   X

Vib.
sym.
 No.   Approximate
 type of mode
 cm-1   Med.   Method   References

au 4 AuOH deform. 532.5 Ar IR Wang and Andrews, 2005
Wang and Andrews, 2005
bu 6 OH stretch 3565.9 Ar IR Wang and Andrews, 2005
Wang and Andrews, 2005
7 AuOH bend 884.9 Ar IR Wang and Andrews, 2005
Wang and Andrews, 2005
8 AuO2 stretch 676.6 Ar IR Wang and Andrews, 2005
Wang and Andrews, 2005

References

Wang and Andrews, 2005
Wang, X.; Andrews, L., Infrared Spectra and Structures of the Coinage Metal Dihydroxide Molecules, Inorg. Chem., 2005, 44, 24, 9076, https://doi.org/10.1021/ic051201c . [all data]