AlNAl-

Vibrational and/or electronic energy levels

Data compiled by: Marilyn E. Jacox

State:   ?

 Energy
 (cm-1
 Med.   Transition   λmin
 (nm)
 λmax
 (nm)

References

Td = 20740 ± 65 gas Meloni, Sheehan, et al., 2006

State:   X

Vib.
sym.
 No.   Approximate
 type of mode
 cm-1   Med.   Method   References

Σg+ 1 Sym. stretch 520 ± 60 gas PE Meloni, Sheehan, et al., 2006

Meloni, Sheehan, et al., 2006
Meloni, G.; Sheehan, S.M.; Parsons, B.F.; Neumark, D.M., Spectroscopic Investigation of Al, J. Phys. Chem. A, 2006, 110, 10, 3527, https://doi.org/10.1021/jp0562781 . [all data]