Cl2V(O)OCD3
- Formula: CD3Cl2O2V
- Molecular weight: 171.899

Vibrational and/or electronic energy levels

Data compiled by: Marilyn E. Jacox
State: X
Vib. sym. |
No. | Approximate type of mode |
cm-1 | Med. | Method | References | |
---|---|---|---|---|---|---|---|
CD3 a-stretch | 2186 | Ar | IR | Ault, 1999 | |||
CD3 a-stretch | 2179 | Ar | IR | Ault, 1999 | |||
CD3 s-stretch | 2050 | Ar | IR | Ault, 1999 | |||
CD3 deform. | 1085 | Ar | IR | Ault, 1999 | |||
C-O stretch | 1066 | Ar | IR | Ault, 1999 | |||
CD3 a-deform. | 1050 | Ar | IR | Ault, 1999 | |||
V=O stretch | 1030 | Ar | IR | Ault, 1999 | |||
CD3 rock | 897 | Ar | IR | Ault, 1999 | |||
CD3 rock | 887 | Ar | IR | Ault, 1999 | |||
V-O stretch | 646 | Ar | IR | Ault, 1999 | |||
VCl2 stretch | 502 | Ar | IR | Ault, 1999 | |||
VCl2 stretch | 443 | Ar | IR | Ault, 1999 | |||

References

Ault, 1999
Ault, B.S.,
Matrix Isolation and Density Functional Study of the Reaction of OVCl,
J. Phys. Chem. A, 1999, 103, 51, 11474, https://doi.org/10.1021/jp993318q
. [all data]