c-CD3CD=ND

Vibrational and/or electronic energy levels

Data compiled by: Marilyn E. Jacox

State:   X

Vib.
sym.
 No.   Approximate
 type of mode
 cm-1   Med.   Method   References

a' 1 ND stretch 2425 w Ar IR Stolkin, Ha, et al., 1977
2 CD3 a-stretch 2256 w m Ar IR Stolkin, Ha, et al., 1977
3 CD stretch 2191 m Ar IR Stolkin, Ha, et al., 1977
4 CD3 s-stretch 2062 w Ar IR Stolkin, Ha, et al., 1977
5 C=N stretch 1631 s Ar IR Stolkin, Ha, et al., 1977
5 C=N stretch 1628 vs Ar IR Stolkin, Ha, et al., 1977
6 Mixed 1159 m s Ar IR Stolkin, Ha, et al., 1977
7 Mixed 1072 m Ar IR Stolkin, Ha, et al., 1977
8 CD3 a-deform. 1032 w m Ar IR Stolkin, Ha, et al., 1977
9 Mixed 850 w Ar IR Stolkin, Ha, et al., 1977
10 CD rock 796 s Ar IR Stolkin, Ha, et al., 1977
11 CD3 rock 736 m Ar IR Stolkin, Ha, et al., 1977
12 CCN bend 405 m Ar IR Stolkin, Ha, et al., 1977
a 13 CD3 a-stretch 2216 w m Ar IR Stolkin, Ha, et al., 1977
14 CD3 a-deform. 1039 s Ar IR Stolkin, Ha, et al., 1977
15 CD3 wag 848 m s Ar IR Stolkin, Ha, et al., 1977
16 C=N torsion 811 s Ar IR Stolkin, Ha, et al., 1977
17 CD wag 527 m Ar IR Stolkin, Ha, et al., 1977

References

Stolkin, Ha, et al., 1977
Stolkin, I.; Ha, T.-K.; Gunthard, H.H., N-methylmethyleneimine and ethylideneimine: Gas- and matrix-infrared spectra, AB initio calculations and thermodynamic properties, Chem. Phys., 1977, 21, 3, 327, https://doi.org/10.1016/0301-0104(77)85189-6 . [all data]