Ga2D4

Vibrational and/or electronic energy levels

Data compiled by: Marilyn E. Jacox

State:   X

Vib.
sym.
 No.   Approximate
 type of mode
 cm-1   Med.   Method   References

GaD stretch 1356.6 Ne IR Wang and Andrews, 2003
GaD stretch 1346.3 D2 IR Wang and Andrews, 2003
GaD stretch 1338.4 D2 IR Wang and Andrews, 2003

References

Wang and Andrews, 2003
Wang, X.; Andrews, L., Infrared Spectra of Gallium Hydrides in Solid Hydrogen: GaH, J. Phys. Chem. A, 2003, 107, 51, 11371, https://doi.org/10.1021/jp035393d . [all data]