DOCCOD

Vibrational and/or electronic energy levels

Data compiled by: Marilyn E. Jacox

State:   X

Vib.
sym.
 No.   Approximate
 type of mode
 cm-1   Med.   Method   References

b 8 OD stretch 2591.1 s Ar IR Maier and Rohr
9 Deformation 1302.9 vs Ar IR Maier and Rohr
10 Deformation 950.9 w m Ar IR Maier and Rohr

References

Maier and Rohr
Maier, G.; Rohr, C., Liebigs Ann. 1996, 307.. [all data]