PtCCD2

Vibrational and/or electronic energy levels

Data compiled by: Marilyn E. Jacox

State:   X

Vib.
sym.
 No.   Approximate
 type of mode
 cm-1   Med.   Method   References

a1 1 CD2 s-stretch 2221.1 Ne IR Wang and Andrews, 2004
1 CD2 s-stretch 2218.9 Ar IR Wang and Andrews, 2004
2 CC stretch 1673.4 Ne IR Wang and Andrews, 2004
2 CC stretch 1662.6 Ar IR Wang and Andrews, 2004
b1 4 OPLA 566.6 Ar IR Wang and Andrews, 2004

References

Wang and Andrews, 2004
Wang, X.; Andrews, L., Infrared Spectra and Density Functional Calculations for Three Pt-C, J. Phys. Chem. A, 2004, 108, 22, 4838, https://doi.org/10.1021/jp049218o . [all data]