LiCD3
- Formula: CD3Li
- Molecular weight: 24.994

Vibrational and/or electronic energy levels

Data compiled by: Marilyn E. Jacox
State: X
Vib. sym. |
No. | Approximate type of mode |
cm-1 | Med. | Method | References | |
---|---|---|---|---|---|---|---|
a1 | 1 | CD3 s-stretch | 2030 | Ar | IR | Andrews, 1967 | |
2 | CD3 umbrella | 883 | Ar | IR | Andrews, 1967 | ||
3 | CLi stretch | 510 | Ar | IR | Andrews, 1967 | ||
e | 5 | CD3 deform. | 1027 | Ar | IR | Andrews, 1967 | |
6 | DCLi deform. | 319 | Ar | IR | Andrews, 1967 | ||

References

Andrews, 1967
Andrews, L.,
Infrared Spectrum of Methyl Lithium Monomer in Solid Argon,
J. Chem. Phys., 1967, 47, 11, 4834, https://doi.org/10.1063/1.1701708
. [all data]